program: Gaussian 09
title: 000199226
version: EM64L-G09RevD.01
frameworkgroup: C1[X(C6H13NO2)]
method: RPBEPBE
basis: SDD
operation: Freq
keyword: #p
keyword: freq=noraman
keyword: PBEPBE/SDD
title: #p freq=noraman PBEPBE/SDD
converged: YES YES NO NO
title: Mulliken charges:
elementType: O O N C C C C C C H H H H H H H H H H H H H
charge: -0.267820 -0.244383 -0.083853 -0.338786 -0.501534 -0.613354 -0.620866 0.241687 -0.505741 0.185968 0.244173 0.259659 0.248551 0.188438 0.221461 0.229525 0.231515 0.222749 0.186950 0.233172 0.241008 0.241481
chargesum: 0.00000
title: Mulliken charges with hydrogens summed into heavy atoms:
elementType: O O N C C C C C C
charge: -0.267820 -0.244383 -0.083853 0.091355 0.006677 0.026070 0.020349 0.241687 0.209919
polarizability: 1.02022671e+02 -2.21302056e+00 7.57122774e+01 -1.08773578e+00 -1.13444633e+00 6.03975531e+01
1716.lowfreq: -6.7020 -3.8891 -0.0008 -0.0007 -0.0007 13.6450 28.5030 53.3932 95.9955
frequency: 28.0919 52.9384 95.9043 104.1320 114.1821 180.2523 219.3633 235.5770 255.7002 269.6218 328.1162 350.5628 440.0447 469.8475 571.0051 663.1873 783.3735 800.6355 860.1978 955.1279 1024.1643 1033.1689 1043.0501 1078.2803 1093.1843 1113.2718 1128.7250 1137.3873 1148.2857 1167.0917 1216.8125 1268.0086 1293.5860 1312.5244 1380.1562 1418.0353 1422.8696 1441.3530 1443.7616 1453.2541 1462.1398 1464.8480 1467.7415 1475.4952 1480.0036 1486.6734 1645.1735 2844.9727 2846.9145 2866.3159 2997.0925 3004.1676 3020.9047 3027.9643 3046.0525 3072.7862 3080.4384 3085.0517 3105.4773 3148.2932
redmass: 4.0160 2.9197 2.6160 1.0694 2.4365 3.0479 1.2304 1.6121 1.8940 2.7009 2.9522 2.6250 2.2888 3.0204 3.1753 4.6503 1.8842 2.5096 4.6987 5.8424 2.5113 1.4816 1.9111 1.9978 1.5217 1.2695 1.7240 2.0797 1.4387 1.6604 1.8211 2.7189 1.2817 1.5993 1.4374 1.1423 1.1932 1.1124 1.1422 1.0500 1.0467 1.0508 1.0592 1.0524 1.0804 1.0572 8.9301 1.0682 1.0577 1.0593 1.0625 1.0299 1.0726 1.0718 1.0881 1.0975 1.1002 1.1002 1.1045 1.1047
irintensity: 1.5038 0.1385 0.6860 0.3326 2.4126 8.6164 1.4284 3.5047 0.9242 12.7912 16.9501 5.0229 0.2848 3.2566 3.1239 9.0587 0.1881 19.3847 17.7453 19.8985 89.2509 9.3370 17.2818 5.4145 9.1823 0.6540 50.6338 142.1882 4.1752 60.7018 28.4061 2.1440 18.4906 60.7876 29.1404 4.7309 23.3426 20.5916 2.6549 14.1982 18.3023 11.3738 1.5931 12.2414 18.9248 19.6469 164.4979 49.3945 77.5682 228.4698 12.5610 31.2039 42.1642 45.9720 4.3602 10.5504 37.4368 47.5656 28.5905 16.9978
temp: 298.150 k
press: 1.00000 atm
elementType: 8 8 7 6 6 6 6 6 6 1 1 1 1 1 1 1 1 1 1 1 1 1
symmnumber: 1
zpe: 490608.5 jmol-1
zpe.correction: 0.186863 hartree
zpe.thermalcorrener: 0.198375 hartree
zpe.thermalcorrenthalpy: 0.199319 hartree
zpe.thermalcorrgfe: 0.148508 hartree
zpe.sumelectzpe: -440.864765 hartree
zpe.sumelectthermal: -440.853253 hartree
zpe.sumelectthermalent: -440.852309 hartree
zpe.sumelectthermalfe: -440.903119 hartree
dipole: -0.0683 1.4199 0.5630
dipole: 1.5290
quadrupole: -43.8513 -59.5971 -56.5592
quadrupole: -2.4652 1.6467 1.2742
quadrupole: 9.4845 -6.2612 -3.2233 -2.4652 1.6467 1.2742
hfenergy: -441.0516275 hartree
pointgroup: C01 [X(C6H13N1O2)]
dipole: 0.0417882 -0.522331 0.2954161 debye
dipolederiv: -1.3845623 0.2954601 -0.029859 0.4280147 -0.6517188 0.0134812 -0.0531301 0.0135081 -0.3001777 -0.6847127 -0.1403214 -0.0007447 0.1867534 -0.9258163 -0.0041036 -0.0160556 -0.0207865 -0.309502 -0.6591963 0.0323062 0.0468627 0.023962 -0.4917585 -0.0172473 0.012653 -0.0106196 -0.5772919 0.5365056 0.1049834 0.0608355 0.0328541 0.0784572 0.076105 0.0444096 0.0762644 0.4170006 -0.3930206 -0.0676031 -0.0142597 -0.1321856 -0.0506049 -0.0512783 -0.138311 -0.0863672 0.0889028 0.2991315 -0.1900233 -0.0330447 -0.2595603 0.2632364 0.0854857 -0.0301465 0.0816611 0.3355779 0.0851638 0.0772105 -0.0738172 0.0970619 0.3087509 -0.0755017 -0.1082901 -0.0663686 0.4360322 1.6069554 -0.1180175 0.064988 -0.5076397 1.2711625 0.0064031 0.1190587 0.0234861 0.2030203 0.6121483 -0.0368826 0.0144758 0.073404 0.2142646 0.0006326 0.0086095 0.0020845 0.2794535 -0.075197 -0.0070955 0.0222441 -0.0075614 0.0384758 -0.0397023 -0.1062398 -0.1037575 -0.2538691 0.0884087 -0.0142611 -0.0066857 -0.0172877 -0.0785326 0.0651792 0.0061854 0.0768597 0.0321185 0.0947766 -0.0183022 -0.0225256 0.0178308 0.0911904 -0.0363966 0.0469029 -0.0434029 -0.0545101 0.0877518 0.0066679 -0.005731 0.0388956 -0.0500116 0.0693286 0.0293856 0.0950696 0.0517263 -0.0173716 0.0743352 0.001489 0.1176914 -0.025907 -0.0540877 0.1616003 -0.1769436 -0.2272952 -0.1600051 -0.0322502 -0.0766121 -0.1087685 0.051852 -0.0592054 -0.0698723 -0.049277 0.0629904 0.0906419 -0.0674026 0.0633528 0.0084141 -0.0991529 0.1127291 0.0427136 0.108344 0.0121075 -0.0001721 0.1774482 0.024197 0.1402794 -0.0564696 -0.0031913 0.0377394 -0.0006512 0.0573406 -0.1444626 -0.1358053 -0.0543342 -0.0662219 0.0686618 -0.0087421 -0.0808291 -0.0206223 0.0468825 0.0583907 -0.0324421 0.0202473 -0.0109858 -0.0112477 -0.0790159 0.0942957 0.098693 -0.3026089 -0.0282547 0.0798916 -0.003797 0.1281684 -0.0366925 0.0017986 -0.0032738 0.0000331 0.1206824 -0.0064647 0.0097299 0.0096488 -0.0868134 0.0490169 -0.1035296 -0.0459265 -0.0839044 -0.0649301 -0.0064547 0.0023739 -0.0069302 -0.0963057 0.0428437 0.1008587 0.0485207 0.0866972 -0.0536504 unknown
polarizability: 102.1175759|-1.7132147|75.6808141|0.2836073|-0.936211|60.3341119 unknown
InChI: InChI=1S/C6H13NO2/c1-7(2)5-4-6(8)9-3/h4-5H2,1-3H3
charge 0 multiplicity 1
22 atoms
O  2.514539 -0.735499 -0.060021
O  1.682519 1.438938 -0.088202
N  -2.344374 -0.144322 -0.215497
C  -1.033625 0.413668 0.190888
C  0.134853 -0.494649 -0.238996
C  -3.418026 0.869196 -0.140868
C  -2.70774 -1.375223 0.516909
C  1.477432 0.203539 -0.116027
C  3.886332 -0.173679 0.000608
H  -0.978147 0.598239 1.295294
H  -0.905228 1.394288 -0.300861
H  -0.014958 -0.772319 -1.301524
H  0.178563 -1.438036 0.331458
H  -3.616415 1.232936 0.899738
H  -4.357591 0.442891 -0.536087
H  -3.149953 1.741638 -0.762595
H  -1.955759 -2.164259 0.345077
H  -3.676872 -1.75165 0.143977
H  -2.799379 -1.217284 1.622714
H  4.548233 -1.050845 0.010186
H  4.011768 0.429881 0.915299
H  4.079431 0.462251 -0.879768
