program: Gaussian 09
title: 000199231
version: EM64L-G09RevD.01
frameworkgroup: C1[X(C12H16N2O2)]
method: RPBEPBE
basis: SDD
operation: Freq
keyword: #p
keyword: freq=noraman
keyword: PBEPBE/SDD
title: #p freq=noraman PBEPBE/SDD
converged: YES YES NO NO
title: Mulliken charges:
elementType: O O N N C C C C C C C C C C C C H H H H H H H H H H H H H H H H
charge: -0.205630 -0.207112 -0.066131 -0.165629 -0.464996 -0.444203 -0.429384 -0.430512 -0.413871 -0.510511 -0.509424 0.192421 0.187883 -0.452456 -0.008986 0.054867 0.221969 0.227990 0.226427 0.221754 0.222820 0.224850 0.249660 0.226363 0.243974 0.218214 0.264359 0.264228 0.264683 0.265025 0.267693 0.263665
chargesum: 0.00000
title: Mulliken charges with hydrogens summed into heavy atoms:
elementType: O O N N C C C C C C C C C C C C
charge: -0.205630 -0.207112 -0.066131 -0.165629 -0.015036 0.003978 0.018286 0.045512 0.048317 0.018076 0.020284 0.192421 0.187883 0.078902 -0.008986 0.054867
polarizability: 1.78734198e+02 2.40791853e+00 1.37156358e+02 -3.30701249e+00 -5.21921945e+00 1.13205935e+02
1716.lowfreq: -13.2854 -0.0009 -0.0004 -0.0004 0.9641 4.2633 11.2691 16.4523 33.1486
frequency: 7.7070 15.8148 32.6646 58.0649 64.7893 78.8274 86.9802 111.4347 139.5107 200.3671 237.0271 256.9698 285.8204 347.2824 354.1467 366.5104 442.9104 489.8472 539.4519 542.9627 565.1698 610.4596 633.1057 638.1181 653.2382 722.7433 754.5035 792.6604 825.1729 829.4078 842.2406 873.3392 877.0832 905.5428 931.4586 968.8893 1004.9805 1010.5798 1010.7326 1041.1321 1043.2774 1050.3471 1066.4924 1104.5900 1142.4272 1166.4298 1169.3655 1173.4991 1187.0434 1207.5533 1217.3065 1235.5971 1244.1317 1249.0015 1282.1297 1289.0562 1297.7162 1307.2379 1315.6812 1318.6105 1328.8378 1351.3753 1369.8813 1433.7738 1439.1742 1454.6975 1455.5864 1465.2072 1472.1365 1474.0214 1489.7120 1635.3312 1698.8027 2291.9529 2848.0504 2993.9286 3000.8447 3001.9735 3004.8515 3009.0072 3018.2552 3027.1864 3036.7965 3054.3265 3061.6553 3069.2591 3078.9456 3079.8401 3091.3977 3097.5758
redmass: 4.6655 6.0202 3.3414 2.1852 3.7589 2.6488 1.8846 6.8428 3.4370 4.1417 5.6103 2.2248 3.2781 5.5959 4.0393 2.2296 5.2500 4.9347 4.0958 3.5131 3.1987 4.7488 2.5885 2.9089 6.0364 5.1210 2.0051 3.3116 1.6000 1.7921 2.1419 3.5310 2.2756 2.5803 1.6955 1.8244 2.7444 2.2016 2.7441 2.2962 3.1136 4.8561 2.2816 2.5485 1.2239 2.3519 1.7752 2.1292 1.2027 1.1121 1.1630 1.2254 1.3614 1.7459 1.3266 1.5145 1.2428 1.3932 1.4098 1.5630 2.1670 1.4164 1.7671 1.0998 1.0753 1.0810 1.0955 1.0819 1.0791 1.0865 1.0932 12.3453 11.6283 11.7562 1.0699 1.0628 1.0610 1.0651 1.0579 1.0846 1.0648 1.0594 1.0635 1.1008 1.1028 1.1018 1.1027 1.1033 1.1048 1.1016
irintensity: 0.2112 0.1668 0.5140 0.1191 3.0268 0.5779 0.0552 11.8298 1.9349 5.0145 1.1894 12.8185 1.5843 14.7794 6.2049 3.3587 14.6416 0.0640 0.0815 0.1311 6.2772 7.5999 6.1449 6.8744 35.5233 8.5911 21.0137 1.6782 9.7451 12.6792 10.3394 16.9304 17.3618 1.0003 12.7389 2.8920 12.9425 0.0359 29.8570 15.3851 10.6884 9.0620 9.3380 0.4494 1.1198 108.1140 58.3345 20.1348 5.3145 0.0554 3.3918 11.6218 2.7870 52.5600 5.9788 1.8501 1.4857 3.3395 58.8777 67.8266 169.5284 16.3330 59.2350 44.2677 0.6531 5.9066 20.3542 2.2082 12.1451 8.8584 9.8677 577.2646 15.4778 4.3038 63.3586 42.3061 26.0413 57.3235 12.5097 12.6234 41.9182 13.3530 2.5815 17.2431 0.4919 8.0522 27.2671 0.0041 80.9325 8.5972
temp: 298.150 k
press: 1.00000 atm
elementType: 8 8 7 7 6 6 6 6 6 6 6 6 6 6 6 6 1 1 1 1 1 1 1 1 1 1 1 1 1 1 1 1
symmnumber: 1
zpe: 688160.9 jmol-1
zpe.correction: 0.262107 hartree
zpe.thermalcorrener: 0.278181 hartree
zpe.thermalcorrenthalpy: 0.279125 hartree
zpe.thermalcorrgfe: 0.213648 hartree
zpe.sumelectzpe: -725.562387 hartree
zpe.sumelectthermal: -725.546312 hartree
zpe.sumelectthermalent: -725.545368 hartree
zpe.sumelectthermalfe: -725.610845 hartree
dipole: -0.3964 1.7496 2.3098
dipole: 2.9246
quadrupole: -77.4821 -102.6031 -95.1912
quadrupole: -9.8896 3.1137 6.6168
quadrupole: 14.2767 -10.8443 -3.4324 -9.8896 3.1137 6.6168
hfenergy: -725.8244933 hartree
pointgroup: C01 [X(C12H16N2O2)]
dipole: -0.108447 -0.7533084 -0.8629645 debye
polarizability: 178.1014768|-1.8861142|136.2671893|7.1763521|-7.0654596|114.727825 unknown
InChI: InChI=1S/C12H16N2O2/c15-11-5-6-12(16)14(11)10-4-3-9-13-7-1-2-8-13/h1-2,5-10H2
charge 0 multiplicity 1
32 atoms
O  -1.902022 -1.81408 1.201891
O  -3.498616 1.904488 -1.163375
N  3.273396 0.533998 0.647492
N  -2.503812 0.220182 0.162754
C  4.871047 -0.584713 -0.841594
C  3.798502 -1.635511 -0.398735
C  4.689965 0.592552 0.17701
C  3.018738 -0.93354 0.773188
C  2.345742 1.216018 -0.308921
C  -3.552923 -1.743269 -0.683261
C  -4.075826 -0.515515 -1.468234
C  -2.557963 -1.183556 0.341141
C  -3.364681 0.697417 -0.856305
C  -1.631571 1.107433 0.964479
C  0.94325 1.185954 0.13909
C  -0.238214 1.147432 0.487974
H  5.896411 -0.992788 -0.812846
H  4.681752 -0.241151 -1.874811
H  3.122712 -1.891345 -1.233921
H  4.263736 -2.575668 -0.054334
H  5.345721 0.432159 1.053625
H  4.926142 1.584954 -0.2446
H  1.935526 -1.138215 0.77066
H  3.421674 -1.26732 1.747401
H  2.675269 2.269562 -0.392306
H  2.385465 0.787088 -1.342933
H  -3.032475 -2.478667 -1.320225
H  -4.349029 -2.287506 -0.147191
H  -5.166317 -0.373231 -1.379952
H  -3.842693 -0.556467 -2.546018
H  -1.654041 0.743395 2.008216
H  -2.084959 2.115311 0.924539
