program: Gaussian 09
title: 000199216
version: EM64L-G09RevD.01
frameworkgroup: C1[X(C8H11NS)]
method: RPBEPBE
basis: SDD
operation: Freq
keyword: #p
keyword: freq=noraman
keyword: PBEPBE/SDD
title: #p freq=noraman PBEPBE/SDD
converged: YES YES NO NO
title: Mulliken charges:
elementType: S N C C C C C C C C H H H H H H H H H H H
charge: -0.023822 -0.543584 -0.693930 0.589341 -0.375083 -0.413696 -0.371557 -0.220751 -0.238505 -0.241432 0.276135 0.208272 0.243558 0.233463 0.232276 0.228296 0.227542 0.231306 0.096153 0.286027 0.269990
chargesum: 0.00000
title: Mulliken charges with hydrogens summed into heavy atoms:
elementType: S N C C C C C C C C
charge: 0.072331 0.012433 -0.417794 0.589341 0.076746 -0.180233 -0.139280 0.007546 -0.010963 -0.010127
polarizability: 1.32360599e+02 -7.15551236e+00 8.84978737e+01 -4.03019608e-01 6.84085356e+00 9.86935979e+01
1716.lowfreq: -8.3423 -0.0021 -0.0020 -0.0019 3.9077 11.0906 30.3319 82.0737 125.5980
frequency: 30.1732 82.0612 125.5603 138.6749 183.3713 221.1178 253.9944 292.9781 352.6065 401.6619 432.1077 498.1336 547.1196 571.2166 616.2302 658.7810 703.4167 756.6504 770.0561 841.5836 854.2260 908.8622 928.0659 977.2676 988.9306 996.6347 1009.1682 1032.3185 1073.8952 1093.3258 1131.6713 1173.2442 1190.8664 1205.6008 1215.8145 1292.8250 1324.9641 1332.9288 1344.9266 1383.1068 1440.4880 1463.3759 1482.9353 1591.1602 1610.7073 1642.8277 2432.4526 3004.6655 3028.2509 3070.9981 3118.7380 3120.2031 3134.9692 3146.0168 3164.2451 3467.2073 3595.1602
redmass: 3.9240 3.9966 2.2550 1.4106 4.3550 1.6591 4.5927 1.2915 5.5095 2.8096 2.9151 3.3393 2.9963 1.5111 6.3037 3.3366 1.6985 3.1088 1.6399 1.4086 1.2704 1.4370 1.4995 1.3914 5.7121 1.3270 3.7547 2.1641 1.5244 3.5763 1.4845 1.0557 1.1138 2.2811 1.1288 1.6204 1.2196 1.2444 1.2346 6.8089 2.1738 1.0956 2.2302 5.9342 6.0861 1.0907 1.0382 1.0640 1.0839 1.1022 1.0854 1.0878 1.0909 1.0959 1.1015 1.0446 1.0983
irintensity: 0.0885 0.0212 5.7486 14.3060 4.7739 20.9823 4.1438 35.1880 7.9636 0.0521 14.7117 4.4934 1.2497 333.1526 3.9923 116.2446 58.9936 6.8506 19.9394 6.6168 1.6892 3.4802 1.0952 0.1247 0.8338 0.0667 8.1116 6.4890 7.8065 15.6973 3.2134 0.1900 0.0355 3.4281 0.9319 2.5040 1.1662 3.0352 2.5687 0.1459 9.3562 14.3950 10.9281 1.2520 4.1423 32.9209 23.7314 21.8827 11.4846 30.6069 8.5056 2.4415 8.8898 40.0539 21.8254 1.9593 2.2325
temp: 298.150 k
press: 1.00000 atm
elementType: 16 7 6 6 6 6 6 6 6 6 1 1 1 1 1 1 1 1 1 1 1
symmnumber: 1
zpe: 445313.1 jmol-1
zpe.correction: 0.169611 hartree
zpe.thermalcorrener: 0.180212 hartree
zpe.thermalcorrenthalpy: 0.181156 hartree
zpe.thermalcorrgfe: 0.132628 hartree
zpe.sumelectzpe: -763.496844 hartree
zpe.sumelectthermal: -763.486243 hartree
zpe.sumelectthermalent: -763.485299 hartree
zpe.sumelectthermalfe: -763.533826 hartree
dipole: -1.8842 0.8772 -0.4787
dipole: 2.1329
quadrupole: -67.7145 -77.0079 -59.2015
quadrupole: -0.0857 -1.6149 -0.8219
quadrupole: 0.2601 -9.0332 8.7731 -0.0857 -1.6149 -0.8219
hfenergy: -763.6664547 hartree
pointgroup: C01 [X(C8H11N1S1)]
dipole: -0.6749138 -0.3781485 0.3250176 debye
dipolederiv: -0.4122667 0.0169655 0.079438 0.0033969 -0.3057109 0.2354036 0.1876756 0.3271771 -0.1454272 -0.5210461 0.3596807 -0.0094928 0.4049529 -0.9675984 0.2769863 0.0810728 0.1309771 -0.3387055 0.3167194 0.1454669 -0.0402527 0.1028591 0.2870035 -0.1282124 -0.0342362 -0.3426888 0.2894444 0.1502569 0.1264891 -0.0597848 0.1414918 -0.0525238 0.0206012 -0.0548789 0.0034287 -0.0679642 0.1915574 -0.1832568 0.0476625 -0.1708802 0.4806741 -0.1730797 -0.0135543 -0.0751729 0.2678965 -0.1772713 0.0167794 0.0556752 0.0348057 -0.0389057 0.1276482 0.0304399 0.1196379 -0.031314 -0.1098395 -0.0580533 -0.0353676 -0.0731913 -0.1207688 0.0680287 -0.0820101 0.0803497 -0.0587026 0.0417634 -0.0345849 -0.0916464 -0.0465633 -0.0599943 0.095329 -0.0886252 0.0861691 -0.0044074 -0.0183361 0.0321067 0.0319614 0.0739203 -0.0252415 0.1276883 0.0523088 0.1361615 0.008027 0.0547608 0.0283212 0.0202271 0.0262298 -0.1323675 0.050449 0.0003571 0.0381022 -0.1092375 0.0272711 -0.0020594 0.0093453 -0.032385 0.0065908 -0.03499 -0.0313295 -0.0536672 -0.0791426 0.1116907 -0.0016453 -0.0670294 0.0070631 0.0007783 -0.0239576 -0.0188631 -0.0304223 -0.1503249 -0.1370755 -0.0422322 -0.0088519 -0.0537988 0.025072 0.0224082 -0.0388835 0.0083589 0.0816781 0.0589838 -0.0601232 -0.0689447 -0.0495348 0.0402228 -0.1069518 -0.0384251 -0.1017536 0.023452 0.0075841 0.0618054 0.0964248 0.0503728 0.0830906 -0.0571779 0.1065476 -0.0704418 0.0426372 -0.0192027 0.05071 0.0893478 0.0601658 0.0882409 -0.0916176 0.0996731 -0.0886108 0.0298815 0.0515298 -0.046458 -0.037836 -0.0594315 0.0392877 -0.1248188 -0.0551521 -0.1291694 0.0109349 -0.1238857 -0.0476196 -0.0118139 -0.0510042 0.1215726 -0.0377443 -0.0099315 -0.038337 0.1177211 0.1206926 -0.0801241 -0.0624073 -0.0884355 -0.0307619 -0.1410621 -0.0589722 -0.0431652 -0.0527469 0.0893628 -0.1605471 -0.0028429 -0.1359258 0.3371537 0.0073991 -0.0024395 0.0548798 0.1386646 0.296751 -0.121621 0.0661883 -0.144108 0.2241859 -0.1123295 -0.0307738 -0.0118129 0.0276353 unknown
polarizability: 128.9757637|12.8139962|96.3592039|-5.1188446|7.4310758|94.217103 unknown
InChI: InChI=1S/C8H11NS/c9-6-8(10)7-4-2-1-3-5-7/h1-5,8,10H,6,9H2
charge 0 multiplicity 1
21 atoms
S  2.001808 2.013377 -1.003316
N  2.240816 -1.738102 0.940861
C  1.495467 0.579312 0.192824
C  0.014867 0.256459 0.067516
C  2.456183 -0.630322 -0.000507
C  -0.923476 0.86251 0.942763
C  -0.468695 -0.641335 -0.92211
C  -2.304352 0.588545 0.832248
C  -1.849286 -0.916976 -1.03675
C  -2.773751 -0.303068 -0.160111
H  1.691372 1.040087 1.178818
H  2.369715 -1.016567 -1.033822
H  3.493245 -0.265035 0.1032
H  -0.56621 1.560949 1.709623
H  0.231868 -1.125875 -1.613152
H  -3.012219 1.068676 1.517289
H  -2.203459 -1.61028 -1.808115
H  -3.844635 -0.51684 -0.248826
H  1.62049 1.351858 -2.160215
H  1.322342 -2.186231 0.871954
H  2.507108 -1.539741 1.909228
