program: Gaussian 09
title: 000199211
version: EM64L-G09RevD.01
frameworkgroup: C1[X(C4H7ClO2S)]
method: RPBEPBE
basis: SDD
operation: Freq
keyword: #p
keyword: freq=noraman
keyword: PBEPBE/SDD
title: #p freq=noraman PBEPBE/SDD
converged: NO YES NO NO
title: Mulliken charges:
elementType: Cl S O O C C C C H H H H H H H
charge: -0.038810 0.965640 -0.564970 -0.546274 -0.542964 -0.365316 -0.558809 -0.398711 0.294646 0.310414 0.315531 0.291323 0.298198 0.257072 0.283030
chargesum: 0.00000
title: Mulliken charges with hydrogens summed into heavy atoms:
elementType: Cl S O O C C C C
charge: -0.038810 0.965640 -0.564970 -0.546274 0.062097 -0.049785 0.030711 0.141391
polarizability: 9.04416169e+01 2.38508569e+00 7.94768134e+01 2.91053542e+00 4.09378758e+00 7.01099221e+01
1716.lowfreq: -19.6884 -13.5018 0.0019 0.0030 0.0035 3.0101 41.5550 122.1072 176.8740
frequency: 41.4465 122.0870 176.8695 232.5910 268.0840 281.4014 322.9587 339.5512 450.2472 503.7012 526.3032 556.5496 683.2465 802.1411 821.4471 851.4047 873.9554 932.1509 955.8764 992.7394 1072.5860 1083.9452 1115.7867 1141.4228 1182.0899 1211.2537 1248.3083 1279.0071 1335.1837 1404.1271 1411.9560 1432.5483 3007.2409 3061.5731 3070.6240 3087.2282 3090.8081 3170.9076 3173.4832
redmass: 7.6702 6.1577 8.3526 4.2114 5.1097 5.1468 2.2677 2.8983 7.1439 5.8496 5.6048 4.6180 2.4621 11.6178 2.0063 2.1544 2.8574 2.3105 1.9826 2.0144 1.4388 1.1831 1.3483 1.3614 1.4117 1.2769 1.3130 1.3662 1.3639 1.0968 1.0986 1.0909 1.0632 1.0580 1.0580 1.0964 1.0898 1.1098 1.1124
irintensity: 6.7907 3.9939 1.0609 8.4050 7.5047 13.7789 6.9824 6.0145 7.0611 21.6725 18.9006 27.3533 10.1434 75.0284 2.0104 24.4454 3.0862 72.4906 29.1825 8.8070 9.1863 10.1602 2.2573 6.8509 7.3116 23.1020 1.3793 16.8345 10.0706 21.9539 13.6617 13.5091 7.5885 0.4287 1.4984 3.2163 3.4442 1.3059 0.0197
temp: 298.150 k
press: 1.00000 atm
elementType: 17 16 8 8 6 6 6 6 1 1 1 1 1 1 1
symmnumber: 1
zpe: 283005.5 jmol-1
zpe.correction: 0.107791 hartree
zpe.thermalcorrener: 0.116539 hartree
zpe.thermalcorrenthalpy: 0.117483 hartree
zpe.thermalcorrgfe: 0.073314 hartree
zpe.sumelectzpe: -1164.390525 hartree
zpe.sumelectthermal: -1164.381778 hartree
zpe.sumelectthermalent: -1164.380834 hartree
zpe.sumelectthermalfe: -1164.425003 hartree
dipole: -4.3768 3.6639 0.7984
dipole: 5.7635
quadrupole: -79.6459 -64.5658 -56.4655
quadrupole: -1.0150 -2.6573 -4.1386
quadrupole: -12.7535 2.3266 10.4269 -1.0150 -2.6573 -4.1386
hfenergy: -1164.4983165 hartree
pointgroup: C01 [X(C4H7Cl1O2S1)]
dipole: 1.8764808 -1.2185868 0.3681581 debye
dipolederiv: -0.3760907 -0.1394289 0.0881341 -0.1839399 -0.3278653 0.0699272 0.1569072 0.0938838 -0.2344729 1.4289173 -0.0105234 0.0159113 -0.0414959 1.2012407 -0.0275612 0.0697113 -0.0116457 1.1287542 -0.6887547 -0.005158 0.0260446 -0.1759947 -0.5725892 0.0433449 0.1113064 0.0215967 -0.5440164 -0.5748841 0.0318165 -0.011098 0.2041152 -0.6659078 0.0697037 -0.1040293 0.0757587 -0.5350063 -0.1938366 -0.0325963 -0.0067974 -0.0479063 -0.1893419 -0.0446928 0.0879484 -0.0123508 -0.1678962 0.4637979 0.2046821 -0.1824753 0.2888213 0.4085289 -0.1624095 -0.4368274 -0.1721159 0.2176124 -0.0542353 -0.0144849 -0.0197877 -0.0061584 -0.0868827 -0.022171 -0.0193584 -0.0176686 -0.1186147 -0.0908131 0.0608818 0.0174212 -0.0509433 -0.0772952 -0.0462716 0.1767858 -0.091239 -0.0600204 -0.0172655 -0.0311524 0.0030582 -0.0160909 0.0968151 0.0436905 0.0024829 0.0321305 0.0110541 0.0560288 -0.0247936 -0.0373315 0.0159737 0.0267803 -0.0127704 -0.0419251 -0.0234308 0.0869649 -0.0666104 -0.0194852 -0.0446982 0.0010029 0.0384212 0.0833216 0.0067902 0.0648616 0.0091603 0.0416682 0.0122515 0.0767279 0.0444044 0.019045 0.0258243 0.0366647 0.038031 0.034433 0.0336722 -0.0219849 -0.0153523 -0.0472475 0.0427526 -0.0519006 -0.0248185 -0.0339222 0.0650357 0.0607657 -0.1031808 0.0257351 -0.0578218 0.0034288 0.0631315 -0.0321134 0.055138 0.0197802 -0.0223596 0.0931564 0.0645079 0.0732813 0.0828696 -0.0311665 0.0104751 -0.0190273 0.0872321 unknown
polarizability: 89.6293774|3.0760509|79.2214689|-3.3542057|-5.3084665|71.1775061 unknown
InChI: InChI=1S/C4H7ClO2S/c5-4-1-2-8(6,7)3-4/h4H,1-3H2
charge 0 multiplicity 1
15 atoms
Cl 2.490872 0.923969 -0.326194
S  -1.239831 0.160336 -0.013206
O  -2.29547 -0.863773 0.709416
O  -1.736068 1.550823 -0.703429
C  0.229363 0.454746 1.273697
C  1.425567 -0.289291 0.688504
C  -0.108711 -0.901988 -1.203535
C  0.964638 -1.432128 -0.253659
H  -0.151116 -0.000165 2.201278
H  0.351223 1.542183 1.352514
H  2.108674 -0.654874 1.469707
H  0.2664 -0.191135 -1.953856
H  -0.781429 -1.66001 -1.626193
H  0.550617 -2.250283 0.367719
H  1.828473 -1.828911 -0.812262
