program: Gaussian 09
title: 000199210
version: EM64L-G09RevD.01
frameworkgroup: C1[X(C16H20N2O2)]
method: RPBEPBE
basis: SDD
operation: Freq
keyword: #p
keyword: freq=noraman
keyword: PBEPBE/SDD
title: #p freq=noraman PBEPBE/SDD
converged: YES YES NO NO
title: Mulliken charges:
elementType: O O N N C C C C C C C C C C C C C C C C H H H H H H H H H H H H H H H H H H H H
charge: -0.458304 -0.447393 -0.279392 -0.312114 -0.381693 -0.363392 -0.561258 -0.451897 0.360650 0.280989 0.161203 0.136724 -0.383440 -0.381370 -0.393112 -0.396050 -0.250941 -0.252520 -0.209734 -0.211169 0.188909 0.213426 0.196911 0.203563 0.235941 0.211440 0.229143 0.226392 0.281465 0.247153 0.232695 0.283833 0.216243 0.213623 0.226723 0.224218 0.226752 0.224228 0.357385 0.354171
chargesum: 0.00000
title: Mulliken charges with hydrogens summed into heavy atoms:
elementType: O O N N C C C C C C C C C C C C C C C C
charge: -0.100919 -0.093222 0.002073 -0.064960 0.020642 0.037082 -0.113876 0.003638 0.360650 0.280989 0.161203 0.136724 -0.150744 -0.097537 -0.176870 -0.182427 -0.024218 -0.028302 0.017018 0.013059
polarizability: 2.15393633e+02 -1.53325984e+01 2.08790893e+02 -8.10729199e+00 -7.17649910e+00 1.44621672e+02
1716.lowfreq: -3.3602 0.0006 0.0008 0.0009 5.4253 8.8765 19.3620 22.8542 26.2374
frequency: 18.3915 22.0307 26.1199 38.5828 54.9578 79.5543 106.0014 126.6151 144.0421 162.7401 183.3412 189.1453 221.9760 255.6224 263.6689 310.0143 331.9881 360.2592 374.5099 398.6400 415.6447 434.2896 442.2388 470.6305 507.9410 522.6415 527.2165 542.7640 555.3474 596.7387 611.1404 692.6974 696.9456 716.0092 718.7787 751.6825 756.1230 757.9579 772.1898 811.6947 826.4548 829.8871 845.8673 849.1199 905.9666 934.8788 936.3334 963.2117 971.2432 990.0732 1013.8372 1029.3125 1035.2456 1040.2952 1070.9857 1072.5203 1080.5123 1125.9602 1137.2337 1145.5794 1147.8630 1153.9192 1166.9372 1169.5994 1174.6781 1193.9086 1202.3517 1232.7502 1238.5463 1241.6341 1255.8153 1274.2670 1281.3668 1305.2420 1319.5791 1331.8821 1354.4696 1386.5784 1394.6336 1402.1573 1436.3048 1438.2054 1440.1456 1448.8430 1467.6164 1474.3494 1486.4472 1489.0609 1493.1454 1497.0980 1600.9775 1602.8148 1611.2554 1617.1012 2891.9803 2903.2923 2909.1049 2972.2737 2977.6042 2985.6388 2998.5462 3046.5543 3107.5738 3108.8983 3118.6678 3132.5614 3140.9262 3148.6370 3164.2081 3164.5320 3419.7988 3444.7709 3580.1887 3581.1136
redmass: 5.2319 4.9381 5.0908 4.5526 4.7251 2.5350 2.0953 4.0221 2.7749 4.4421 4.0271 3.6095 4.9684 4.2264 3.3778 2.5272 3.7528 1.1482 1.1384 3.9689 3.5143 3.2044 3.1267 3.6420 4.0431 5.6132 4.4991 3.7227 5.9920 5.5327 3.6795 1.6558 1.5783 2.3348 2.3279 1.3599 3.5344 1.4884 4.5825 1.1769 4.2683 2.3069 1.3362 2.0904 1.8644 1.3926 1.5218 1.6886 1.3256 1.4552 2.2775 2.2939 2.0539 2.1112 2.3757 2.5403 2.5291 1.8190 2.5444 2.4044 1.5441 1.2993 1.0730 1.0720 1.1902 2.8518 2.0473 2.4565 1.5729 2.0152 1.3035 1.1977 1.3855 1.3119 1.2661 1.2318 1.4721 1.9706 6.3951 3.0833 1.9540 2.3258 1.2107 1.2190 1.1833 1.1406 1.1791 2.2808 2.1083 1.1105 6.4042 6.5553 6.7152 6.7459 1.0681 1.0685 1.0646 1.0891 1.0888 1.0596 1.0968 1.1030 1.0883 1.0885 1.0886 1.0875 1.0917 1.0930 1.1003 1.0999 1.0739 1.0738 1.0659 1.0659
irintensity: 0.6030 0.5078 0.1254 0.1984 0.2846 1.2128 2.4357 0.6433 3.0450 3.2140 0.6297 1.2426 1.2733 10.5553 12.9080 9.8059 7.3550 125.1562 132.3113 2.3226 6.8855 8.4363 3.1774 7.5382 15.7650 2.0438 16.8498 2.6213 0.6210 0.8683 7.6509 148.6918 18.1360 12.1513 53.6295 92.1854 24.0556 84.5532 11.8862 3.9656 9.4856 27.2739 0.9089 17.9502 3.4864 3.0471 5.0547 5.2401 0.2048 1.9542 5.5647 9.2883 12.7775 3.5774 66.6717 87.5498 40.4938 56.3707 4.9285 115.5258 80.3889 41.6577 3.7144 0.6870 2.9995 24.9907 26.1741 16.5594 5.1448 35.4556 15.1056 16.4166 19.9244 26.7842 1.2887 4.3290 4.7761 1.3306 6.8233 5.5728 26.2857 33.4093 19.5115 16.2594 63.0354 14.8466 11.7074 13.1450 24.5952 5.4066 19.9182 27.7682 5.0168 2.1900 22.1297 33.2947 138.9230 2.4766 21.9803 49.6809 80.6649 18.6108 16.2049 16.7497 5.9465 8.9665 20.5137 12.4530 21.4385 29.4319 1.0510 1.6305 23.8210 26.4247
temp: 298.150 k
press: 1.00000 atm
elementType: 8 8 7 7 6 6 6 6 6 6 6 6 6 6 6 6 6 6 6 6 1 1 1 1 1 1 1 1 1 1 1 1 1 1 1 1 1 1 1 1
symmnumber: 1
zpe: 866705.3 jmol-1
zpe.correction: 0.330111 hartree
zpe.thermalcorrener: 0.349654 hartree
zpe.thermalcorrenthalpy: 0.350598 hartree
zpe.thermalcorrgfe: 0.279024 hartree
zpe.sumelectzpe: -880.135679 hartree
zpe.sumelectthermal: -880.116136 hartree
zpe.sumelectthermalent: -880.115191 hartree
zpe.sumelectthermalfe: -880.186765 hartree
dipole: 0.0996 1.0381 1.0780
dipole: 1.4999
quadrupole: -91.5133 -118.7400 -109.7337
quadrupole: -8.2108 -10.7131 -2.9063
quadrupole: 15.1490 -12.0777 -3.0714 -8.2108 -10.7131 -2.9063
hfenergy: -880.4657894 hartree
pointgroup: C01 [X(C16H20N2O2)]
dipole: 0.0056076 0.3726524 0.4575273 debye
polarizability: 216.2501836|-14.469078|209.687042|-3.6738392|-3.0063722|142.8689725 unknown
InChI: InChI=1S/C16H20N2O2/c19-15-7-3-1-5-13(15)11-17-9-10-18-12-14-6-2-4-8-16(14)20/h1-8,17-20H,9-12H2
charge 0 multiplicity 1
40 atoms
O  -4.333701 -1.242114 1.286467
O  5.470094 -1.704642 0.516591
N  -2.067135 -1.790023 -0.6520
N  1.461718 -0.514581 -0.187943
C  -0.94876 -0.825489 -0.704511
C  0.339148 -1.477379 -0.165942
C  -3.310958 -1.373913 -1.340786
C  2.732178 -1.04729 0.351065
C  -3.973265 -0.100492 -0.804552
C  3.798025 0.032711 0.481234
C  -4.475897 -0.058131 0.5245
C  5.17068 -0.32407 0.560669
C  -4.091912 1.074234 -1.582331
C  3.470852 1.407423 0.538857
C  -5.080691 1.103451 1.054259
C  6.182617 0.655483 0.685148
C  -4.693469 2.250016 -1.072627
C  4.47029 2.400594 0.666037
C  -5.189935 2.260842 0.249446
C  5.829576 2.022723 0.737373
H  -0.799138 -0.540188 -1.767275
H  -1.132237 0.119167 -0.141193
H  0.179469 -1.78672 0.887905
H  0.534293 -2.409212 -0.749044
H  -4.022086 -2.217355 -1.261389
H  -3.083342 -1.233297 -2.414934
H  3.148192 -1.893432 -0.244323
H  2.517843 -1.469815 1.354759
H  -2.276138 -2.079837 0.313604
H  1.59848 -0.12124 -1.130743
H  -3.706562 1.061973 -2.609652
H  2.410351 1.674809 0.487088
H  -5.463336 1.109288 2.08386
H  7.237491 0.354139 0.742714
H  -4.772766 3.144644 -1.699062
H  4.189449 3.458321 0.710154
H  -5.657877 3.162681 0.658972
H  6.613741 2.781691 0.834116
H  -4.745836 -1.135281 2.179261
H  6.448255 -1.847891 0.552927
