program: Gaussian 09
title: 000199181
version: EM64L-G09RevD.01
frameworkgroup: C1[X(C9H7N3O4)]
method: RPBEPBE
basis: SDD
operation: Freq
keyword: #pfreq=noraman
keyword: PBEPBE/SDD
title: #p freq=noraman PBEPBE/SDD
converged: YES YES NO NO
title: Mulliken charges:
elementType: O O O O N N N C C C C C C C C C H H H H H H H
charge: -0.186778 -0.131959 -0.174631 -0.212242 -0.252110 0.066824 0.063285 0.366227 0.354451 0.188652 -0.331735 -0.368840 -0.818069 -0.225829 -0.217813 0.150269 0.257635 0.244497 0.273614 0.230574 0.239452 0.244549 0.239979
chargesum: 0.00000
title: Mulliken charges with hydrogens summed into heavy atoms:
elementType: O O O O N N N C C C C C C C C C
charge: -0.186778 -0.131959 -0.174631 -0.212242 -0.252110 0.066824 0.063285 0.366227 0.354451 0.188652 -0.074100 -0.124343 -0.074430 0.018720 0.022166 0.150269
polarizability: 1.93771920e+02 3.35572129e+00 1.22329531e+02 -6.73727452e+00 5.49134314e+00 9.72188336e+01
1716.lowfreq: -6.3350 -1.6128 -0.0007 -0.0005 -0.0002 8.2725 22.9211 52.1778 71.8900
frequency: 22.6178 52.1749 71.8769 84.7632 134.9551 140.0243 170.6369 206.7930 244.9096 273.0894 295.2945 338.7598 369.6872 414.1682 434.3739 461.2551 485.0007 528.9326 538.7792 612.8216 619.5311 642.6060 647.2940 696.1420 704.1751 715.9119 768.8836 784.4477 801.4664 870.4921 924.2055 950.5115 989.2201 992.0578 996.5306 1044.3525 1047.0136 1106.7950 1131.7395 1162.7205 1179.4218 1187.7751 1224.7029 1288.3150 1310.3493 1343.7189 1376.0711 1381.0809 1399.8737 1435.4671 1473.5359 1478.4189 1483.7369 1589.3473 1614.6828 1804.6644 2985.1220 3067.2576 3099.2284 3137.6667 3151.0050 3160.6645 3178.2865
redmass: 7.1673 6.6455 9.6786 6.8017 1.1787 6.2413 3.2137 5.3477 7.2237 8.0897 5.0554 5.3215 8.8473 9.4278 3.9764 3.7566 8.2308 5.9226 5.4696 9.9298 8.4324 11.9906 7.5513 12.3291 8.7703 3.0029 1.4177 7.1584 6.6846 1.2953 9.0886 1.3762 1.7262 6.7548 1.3458 1.6321 1.9907 2.6784 8.2130 2.3890 1.0607 13.4553 2.6418 1.4500 10.6957 11.7638 6.8565 9.2895 1.2321 2.2721 1.1533 1.2833 1.7921 6.1353 7.0168 12.9253 1.0382 1.0971 1.0987 1.0873 1.0896 1.0951 1.1010
irintensity: 0.0529 0.1812 0.2591 0.1953 1.5115 3.2288 4.4382 1.8512 2.7299 1.2381 0.7321 0.4171 5.5068 6.7087 2.7856 5.3384 39.8075 2.4151 6.4454 3.8849 5.0538 2.0932 21.5104 10.1377 12.2322 4.9871 71.0216 28.8506 11.1858 0.0167 21.5995 1.2231 2.7003 43.0127 0.1463 8.2215 6.1567 10.3631 48.2612 3.0552 1.0212 119.4977 1.5908 3.1716 120.4311 139.3065 101.5687 17.1580 18.8882 4.4924 18.7256 23.1508 16.2259 1.3008 4.5369 499.3467 11.4299 7.5072 15.9684 2.9166 4.4491 13.7737 11.4559
temp: 298.150 k
press: 1.00000 atm
elementType: 8 8 8 8 7 7 7 6 6 6 6 6 6 6 6 6 1 1 1 1 1 1 1
symmnumber: 1
zpe: 405698.0 jmol-1
zpe.correction: 0.154522 hartree
zpe.thermalcorrener: 0.168363 hartree
zpe.thermalcorrenthalpy: 0.169307 hartree
zpe.thermalcorrgfe: 0.112579 hartree
zpe.sumelectzpe: -810.995007 hartree
zpe.sumelectthermal: -810.981166 hartree
zpe.sumelectthermalent: -810.980222 hartree
zpe.sumelectthermalfe: -811.036950 hartree
dipole: 6.8449 -1.2677 0.8697
dipole: 7.0154
quadrupole: -97.6699 -103.2709 -83.9095
quadrupole: 1.9205 -1.6630 10.4060
quadrupole: -2.7198 -8.3208 11.0406 1.9205 -1.6630 10.4060
hfenergy: -811.1495293 hartree
pointgroup: C01 [X(C9H7N3O4)]
dipole: -2.7034766 0.555589 -0.0218488 debye
dipolederiv: -0.9690529 -0.4236804 0.1199575 0.5224525 -0.098217 0.0019605 -0.1228431 -0.0186356 -0.1381077 -1.4079525 -0.1320513 0.0047774 0.04371 -0.2192505 -0.0080314 -0.060354 -0.0128427 -0.2542519 -0.6073118 0.2978833 -0.0614707 0.2274612 -0.5712749 0.0921406 -0.0354187 0.1089118 -0.2330237 -0.8173731 -0.2288488 0.0788853 -0.0894172 -0.5790495 0.1140251 0.0622485 0.0919373 -0.233492 0.2353227 -0.4352099 0.1136809 -0.4999792 0.2471677 -0.0495632 0.1848931 -0.0357853 0.0254061 0.3971281 0.6283159 -0.1874027 0.5026969 -0.1148115 0.0177604 -0.202472 0.0301377 -0.0639837 1.2592874 -0.038733 -0.0342702 0.0047502 1.6499508 -0.3812278 -0.0551089 -0.4021069 0.3083671 0.3135154 0.000706 0.0055578 -0.0021127 0.0053025 -0.0133057 -0.0899794 -0.0067763 0.064443 0.0731136 0.0221603 0.2501946 0.0379643 0.0130456 -0.0046543 -0.0104106 0.0180217 0.2510929 -0.5369928 0.1567385 -0.0702232 -0.3454141 -0.8846494 0.2445521 0.0318245 0.2547615 -0.0829385 0.0540686 0.0301301 -0.0950286 -0.0151849 -0.0890733 -0.0013139 0.1767421 0.0252337 -0.0256475 -0.1133403 0.0094402 -0.2621047 0.0252061 -0.1452516 -0.0570418 -0.1032591 -0.0247043 -0.0400175 -0.0320503 -0.0031106 -0.1434356 0.0194117 0.0260843 0.0712217 -0.063719 -0.0024393 -0.1055909 -0.1372217 0.0108776 0.1535208 0.019973 -0.1424598 0.0322112 0.0950439 0.0106027 0.0204318 0.1668662 0.0609244 0.0013789 0.0601301 -0.1011523 0.0114791 -0.0166667 0.0042723 0.0637947 2.0667834 0.1629751 0.0118712 -0.3567825 0.312478 -0.0241493 0.1702332 -0.0227488 0.3082484 0.0487155 -0.0239898 0.0784528 -0.0168469 0.1380045 0.0169616 0.0716961 -0.0039813 0.019603 0.0420287 -0.0177759 0.0549887 -0.0328565 0.1465218 0.0032426 0.0870904 0.0073676 -0.0489078 0.0492846 0.068201 -0.0636971 0.065093 -0.0037648 0.0301197 -0.0805936 -0.0188422 0.0756051 0.0094993 -0.1065152 -0.0272622 -0.112289 -0.0079207 -0.0316461 -0.0197827 0.0459479 0.0557454 -0.0321473 0.029291 0.1479225 0.0128122 0.114159 -0.0427363 0.0621555 -0.0290715 -0.0159204 0.0347558 -0.0222088 -0.0645626 -0.0215348 0.1580118 -0.0175295 -0.0772546 -0.0157691 -0.0426011 -0.0969264 -0.0455196 -0.0117308 -0.0492435 0.1461493 -0.0044753 -0.0040652 -0.0034908 0.0917454 unknown
polarizability: 193.3914742|8.1995298|109.9982025|5.1000694|-13.5294958|109.9306077 unknown
InChI: InChI=1S/C9H7N3O4/c1-6-4-2-3-5-7(6)11-8(12(14)15)9(13)16-10-11/h2-5H,1H3
charge 0 multiplicity 1
23 atoms
O  2.061296 2.000859 -0.658553
O  3.901117 0.528038 -0.104105
O  2.598586 -2.102736 0.527468
O  0.301281 -2.07511 0.585633
N  0.366902 0.640681 -0.270986
N  0.657409 1.909962 -0.677429
N  1.457905 -1.508249 0.397373
C  -1.053946 0.295747 -0.258873
C  -1.745985 0.190326 0.974848
C  1.485872 -0.126876 0.021595
C  -1.685118 0.165801 -1.513136
C  -3.133971 -0.077849 0.893426
C  -1.048402 0.330956 2.310231
C  -3.067453 -0.10812 -1.5574
C  -3.789296 -0.231801 -0.349101
C  2.683495 0.646006 -0.189516
H  -1.100548 0.271259 -2.432332
H  -3.705733 -0.166093 1.82374
H  -0.497576 -0.598092 2.54931
H  -0.32342 1.16473 2.321761
H  -1.776902 0.506904 3.118137
H  -3.571256 -0.22008 -2.522143
H  -4.863559 -0.442561 -0.373149
