program: Gaussian 09
title: 000199379
version: EM64L-G09RevD.01
frameworkgroup: C1[X(C26H29ClN2O)]
method: RPBEPBE
basis: SDD
operation: Freq
keyword: #p
keyword: freq=noraman
keyword: PBEPBE/SDD
title: #p freq=noraman PBEPBE/SDD
converged: YES YES NO NO
title: Mulliken charges:
elementType: Cl O N N C C C C C C C C C C C C C C C C C C C C C C C C C C H H H H H H H H H H H H H H H H H H H H H H H H H H H H H
charge: -0.080898 -0.481768 -0.089130 -0.173103 -0.112895 -0.388225 0.031118 -0.359293 -0.359101 -0.410349 -0.387113 -0.761533 0.377125 0.390471 0.486217 -0.370835 -0.416606 -0.399846 -0.403245 -0.361459 -0.367041 -0.250001 -0.261050 -0.222337 -0.222387 -0.243894 -0.243371 -0.222302 -0.222659 -0.118124 0.195736 0.232529 0.210736 0.195112 0.202620 0.211226 0.186977 0.209757 0.215173 0.203691 0.216059 0.255804 0.184226 0.246106 0.343906 0.226381 0.236351 0.285594 0.272673 0.236734 0.222402 0.224436 0.226583 0.224361 0.225925 0.227197 0.230050 0.247287 0.248002
chargesum: 0.00000
title: Mulliken charges with hydrogens summed into heavy atoms:
elementType: Cl O N N C C C C C C C C C C C C C C C C C C C C C C C C C C
charge: -0.080898 -0.137862 -0.089130 -0.173103 0.082841 0.055040 0.031118 0.038440 0.039103 0.014581 0.032637 -0.075397 0.377125 0.390471 0.486217 -0.144454 -0.180255 -0.114252 -0.130572 -0.124725 -0.144639 -0.025565 -0.034468 0.002023 0.003538 -0.016697 -0.013320 0.024985 0.025343 -0.118124
polarizability: 4.05230165e+02 1.73409155e+01 2.53478752e+02 -1.41591666e+01 1.98391116e+01 2.65225250e+02
1716.lowfreq: -8.1773 -1.9564 0.0007 0.0014 0.0017 2.9780 12.9990 16.1668 22.3435
frequency: 11.5116 14.1775 22.3203 38.6174 41.8009 44.9116 53.0880 58.7405 73.9768 89.7064 110.5437 134.3043 150.3988 158.4654 201.1103 215.6160 218.2178 235.5098 251.1263 258.0423 273.2472 282.9528 289.0286 296.0159 318.7443 321.0642 325.8361 353.6194 371.4160 394.0141 402.4863 409.2964 411.4523 426.4542 428.8432 445.4826 473.0358 479.5351 507.6488 521.6017 537.2378 556.6356 616.0685 616.9767 625.5518 629.8097 636.4980 647.7743 694.4836 702.0419 703.9139 711.6576 731.1731 756.4952 772.2358 783.5206 798.2316 806.8579 843.2472 854.2133 860.6197 865.5888 872.1199 897.5869 920.1643 924.5362 926.0581 929.0550 940.6369 945.3985 960.3940 977.3069 980.1685 982.0656 983.9847 989.5853 990.9362 999.1865 1002.0951 1005.9245 1029.0840 1030.3507 1050.7062 1061.3380 1066.5939 1080.1126 1081.2051 1084.0531 1100.5437 1115.5125 1118.5422 1128.9375 1141.5076 1148.1682 1157.5346 1171.9803 1172.0480 1179.9613 1189.8320 1193.1395 1195.9039 1198.6125 1210.6541 1239.6812 1252.6155 1273.6941 1291.7894 1297.5942 1301.3288 1304.3160 1315.3759 1320.6356 1327.0646 1342.9652 1343.2738 1358.6113 1361.7872 1372.5210 1375.9580 1377.3522 1379.1826 1381.6928 1396.2221 1413.5893 1432.1246 1435.8378 1454.0027 1456.4197 1460.8801 1464.8834 1469.3518 1477.6843 1478.0967 1481.2356 1491.2574 1493.9377 1570.9320 1588.2763 1591.5622 1608.0520 1609.9922 1612.1308 2857.8492 2865.8689 2910.5570 2921.2455 2923.7995 2970.8213 2984.2484 3033.9791 3039.1385 3040.3089 3055.1771 3064.1648 3090.1197 3096.1161 3119.3927 3121.4360 3128.0844 3129.2830 3140.8888 3142.0415 3147.2480 3153.1075 3154.2959 3158.5165 3165.5026 3168.4546 3177.3657 3178.1280 3561.4003
redmass: 5.7570 4.3147 4.8718 5.3426 3.7363 4.5388 3.2665 4.5747 4.6454 4.7670 4.4757 4.9625 3.9179 4.6245 4.1730 3.2650 1.5771 1.7595 3.3693 2.9911 3.9736 5.5327 3.2645 4.8399 1.8127 2.5037 3.8188 2.6069 2.3428 2.1703 2.8498 2.7162 2.9690 4.6423 4.1545 4.0248 2.7410 3.1692 2.7816 3.3700 3.9557 3.5856 6.4028 6.4145 6.9162 5.2911 4.2009 2.7171 3.1143 3.1183 2.1784 1.6652 4.7618 1.7873 2.1652 2.3104 1.4719 1.7811 1.5884 1.2594 1.2608 2.7588 3.2012 1.7838 2.3651 1.4091 1.6721 1.6118 1.3672 2.3964 1.8674 2.0758 1.5172 4.0264 1.4056 5.5167 4.8991 1.3293 1.3445 2.5426 2.1974 2.1775 1.7733 2.1138 1.9350 2.4435 1.8053 2.0398 2.0197 2.6639 1.4544 2.4170 2.4935 1.9504 3.0373 1.0899 1.0661 2.3770 1.1419 1.1757 1.1774 1.6197 1.6167 1.4238 1.4090 1.4514 1.5096 1.3835 1.3315 1.4236 1.3549 1.3125 1.4370 1.5727 1.3441 1.8471 1.5278 2.0106 1.5315 3.5972 1.8735 7.5341 1.3966 3.7214 2.2074 2.2499 1.0805 1.0926 1.0960 1.0897 1.0791 1.4078 1.4980 2.2157 2.4865 1.0528 7.2984 6.0973 6.2641 6.0694 6.2674 6.0466 1.0713 1.0697 1.0688 1.0683 1.0697 1.0420 1.0793 1.0908 1.0901 1.0902 1.0903 1.0925 1.0893 1.1000 1.0847 1.0847 1.0879 1.0875 1.0938 1.0929 1.0871 1.0949 1.0881 1.0989 1.1009 1.0962 1.0954 1.0952 1.0655
irintensity: 0.2284 0.1669 0.0904 0.1318 0.2595 0.4864 1.6653 0.0919 0.2227 0.2464 0.6867 0.4041 0.2286 1.5167 9.2498 5.1976 2.0837 1.3974 0.7068 2.1737 2.2101 0.7460 13.3305 16.1445 80.5527 19.3131 8.3204 17.6845 75.1431 4.9422 0.3468 11.2092 0.7286 2.2652 7.4790 1.2416 0.5652 0.6148 24.0167 1.1127 3.1681 17.0518 0.0098 0.0748 0.3595 14.4212 10.9300 52.4181 2.8931 12.1586 34.4573 72.6670 11.9883 50.2174 38.9186 12.1008 2.7486 75.5136 3.5131 0.2915 0.3843 4.2098 18.8265 9.4345 41.6133 1.9647 12.2960 0.4171 2.3820 23.5166 0.3558 44.0031 9.5173 25.5826 0.5614 1.2535 2.2840 0.2819 1.7424 68.6638 14.4301 2.0568 5.0481 7.5309 14.7178 12.2341 5.3334 4.4326 9.7071 0.0955 5.6838 86.2032 29.6158 35.8955 14.0188 0.5054 0.9711 6.5148 2.9155 0.2593 7.9535 7.2110 0.6853 202.2296 22.6966 18.0984 14.1582 19.0553 1.2660 18.5430 4.6215 7.2609 29.7243 1.4906 10.3843 2.6355 12.7446 9.8889 13.4118 16.0385 39.5705 3.6486 8.5975 0.6983 2.9014 23.0917 5.8569 9.1323 69.9343 21.3392 8.3726 27.6953 9.3307 13.7229 270.5828 7.6811 2.5064 0.7649 1.0248 11.4325 102.2663 2.6250 46.9277 76.2805 57.2954 29.0482 125.9925 26.3325 17.0542 3.0004 51.5507 57.5188 22.3161 28.4847 22.8312 22.9731 4.5792 5.2230 3.9127 4.0800 28.5807 36.9051 11.0800 20.5275 8.2791 26.8252 23.4017 14.3211 7.2935 7.1106 6.0074
temp: 298.150 k
press: 1.00000 atm
elementType: 17 8 7 7 6 6 6 6 6 6 6 6 6 6 6 6 6 6 6 6 6 6 6 6 6 6 6 6 6 6 1 1 1 1 1 1 1 1 1 1 1 1 1 1 1 1 1 1 1 1 1 1 1 1 1 1 1 1 1
symmnumber: 1
zpe: 1278214.4 jmol-1
zpe.correction: 0.486846 hartree
zpe.thermalcorrener: 0.514584 hartree
zpe.thermalcorrenthalpy: 0.515528 hartree
zpe.thermalcorrgfe: 0.425257 hartree
zpe.sumelectzpe: -1650.741924 hartree
zpe.sumelectthermal: -1650.714186 hartree
zpe.sumelectthermalent: -1650.713242 hartree
zpe.sumelectthermalfe: -1650.803513 hartree
dipole: -4.4090 -1.1113 0.4175
dipole: 4.5660
quadrupole: -226.8927 -182.9013 -169.8004
quadrupole: 5.7656 6.9494 3.1807
quadrupole: -33.6946 10.2969 23.3977 5.7656 6.9494 3.1807
hfenergy: -1651.2287702 hartree
pointgroup: C01 [X(C26H29Cl1N2O1)]
dipole: -1.7157343 -0.4972593 0.1899443 debye
polarizability: 403.1729845|23.0988839|253.1768731|-17.4858907|18.302734|267.5843099 unknown
InChI: InChI=1S/C26H29ClN2O/c1-21(20-28-16-18-29(19-17-28)25-14-12-24(27)13-15-25)26(30,22-8-4-2-5-9-22)23-10-6-3-7-11-23/h2-15,21,30H,16-20H2,1H3
charge 0 multiplicity 1
59 atoms
Cl 9.513625 0.259909 -1.109965
O  -3.456619 -0.123984 2.134115
N  0.774091 -0.304399 0.933438
N  3.592728 -0.028046 0.294673
C  -1.661974 -0.824849 0.572073
C  -0.619843 0.078469 1.285938
C  -3.109604 -0.221253 0.6945
C  1.21558 0.277618 -0.356024
C  1.758604 0.047243 1.984259
C  2.59666 -0.261344 -0.769255
C  3.144132 -0.513201 1.621354
C  -1.558302 -2.266988 1.119574
C  -3.157411 1.223557 0.150856
C  -4.190223 -1.062437 -0.030147
C  4.969815 -0.004517 -0.027292
C  -2.91267 1.467202 -1.224519
C  -3.916642 -1.847062 -1.179701
C  -3.440618 2.31952 1.000844
C  -5.528397 -0.995708 0.438465
C  5.434736 -0.261617 -1.354946
C  5.953652 0.321688 0.958893
C  -2.935961 2.781748 -1.738308
C  -4.949762 -2.551336 -1.83762
C  -3.47078 3.635689 0.485067
C  -6.561672 -1.700086 -0.216283
C  -3.214702 3.87441 -0.884129
C  -6.277322 -2.483148 -1.358809
C  6.803969 -0.175288 -1.68475
C  7.322034 0.398445 0.636116
C  7.737153 0.153643 -0.687233
H  -1.406855 -0.842221 -0.506663
H  -0.813916 1.150023 1.052118
H  -0.749899 -0.037366 2.378065
H  1.267271 1.394591 -0.294781
H  0.486504 0.020694 -1.145571
H  1.432593 -0.397414 2.942404
H  1.838257 1.155509 2.123396
H  2.511079 -1.346225 -1.011387
H  2.909398 0.274579 -1.681925
H  3.864546 -0.21375 2.397598
H  3.086533 -1.625688 1.619063
H  -0.509648 -2.600244 1.033521
H  -1.824056 -2.308801 2.19546
H  -2.206077 -2.976769 0.57821
H  -3.542852 -1.047032 2.483536
H  -2.725127 0.629415 -1.906364
H  -2.895547 -1.924142 -1.569513
H  -3.633759 2.127516 2.059202
H  -5.749818 -0.375634 1.313333
H  4.737266 -0.554217 -2.143771
H  5.656237 0.549395 1.986501
H  -2.747123 2.952352 -2.804344
H  -4.715953 -3.154844 -2.722078
H  -3.693019 4.474578 1.154709
H  -7.588698 -1.633149 0.160493
H  -3.237715 4.895036 -1.282355
H  -7.078094 -3.029843 -1.869132
H  7.135096 -0.378666 -2.707602
H  8.053494 0.659335 1.406991
