program: Gaussian 09
title: 000199139
version: EM64L-G09RevD.01
frameworkgroup: C1[X(C12H18O3)]
method: RPBEPBE
basis: SDD
operation: Freq
keyword: #pfreq=noraman
keyword: PBEPBE/SDD
title: #p freq=noraman PBEPBE/SDD
converged: YES YES NO NO
title: Mulliken charges:
elementType: O O O C C C C C C C C C C C C H H H H H H H H H H H H H H H H H H
charge: -0.331392 -0.442230 -0.453794 0.331393 -0.444678 -0.390974 -0.430465 -0.784759 0.415109 -0.595892 -0.388162 0.477336 -0.237870 -0.384833 -0.806048 0.257675 0.238402 0.215997 0.202496 0.211893 0.248669 0.213835 0.263483 0.214253 0.367978 0.347334 0.250759 0.295112 0.224595 0.229670 0.228617 0.225001 0.231491
chargesum: 0.00000
title: Mulliken charges with hydrogens summed into heavy atoms:
elementType: O O O C C C C C C C C C C C C
charge: -0.331392 -0.074252 -0.106460 0.331393 0.051399 0.027518 0.030096 -0.093188 0.415109 -0.345132 -0.093051 0.477336 -0.013275 -0.155163 -0.120939
polarizability: 1.89124322e+02 -1.11666352e+00 1.39116938e+02 1.03600068e+01 -2.68045986e-01 9.22484015e+01
1716.lowfreq: -27.1931 -11.5133 -8.8841 -2.5495 -0.0008 -0.0008 -0.0006 27.5129 47.1271
frequency: -26.9328 27.2281 47.1198 61.7611 86.4331 131.0396 165.1341 181.6552 198.5244 226.0983 248.6117 249.7972 270.8203 302.6753 313.3314 333.4635 369.8122 386.1874 429.7240 444.2545 506.6599 530.2279 553.0448 569.5664 571.2667 597.0349 697.6282 711.6576 765.3301 790.1933 865.4239 875.1683 876.4239 897.8315 902.8114 913.0265 956.1196 959.6043 973.6126 977.0846 983.4410 996.6531 1018.8217 1024.9400 1045.4301 1090.1152 1102.3385 1142.2092 1171.5915 1178.7179 1191.1063 1217.4872 1247.3080 1268.0251 1280.3523 1299.6449 1327.4045 1359.8240 1368.0076 1372.4255 1378.5624 1383.5831 1394.6451 1395.9860 1435.4235 1461.5884 1468.7789 1471.8051 1473.7239 1476.9063 1480.4334 1483.6060 1492.2171 1588.8962 1620.2032 2958.6321 2967.0151 2971.9231 2977.2093 3024.1159 3055.6776 3055.8251 3064.1414 3077.1527 3079.4739 3086.0704 3090.9012 3122.9961 3140.2097 3144.8708 3157.1344 3516.1515 3572.8736
redmass: 1.0251 4.1552 4.3650 4.7259 3.7959 4.4407 4.8471 2.7838 4.1176 3.1872 3.4969 1.5050 1.8610 2.5662 1.4254 1.6957 2.3757 4.9019 2.5724 2.8708 4.8423 3.0816 4.3267 4.4703 1.4849 1.8559 2.4398 5.9220 3.7038 1.3277 3.5503 2.3683 1.4703 1.8859 1.4528 1.4373 2.0528 2.6806 1.7559 1.6728 3.3278 2.6728 2.1287 2.1729 1.5533 1.4107 1.6358 1.7752 1.6063 1.3192 1.1945 3.0439 3.2088 1.6390 1.4360 1.3398 1.2782 1.2450 1.3048 1.2075 1.2283 5.7436 1.2472 1.2229 2.1200 1.0770 1.0493 1.0861 1.3036 1.4947 1.0838 1.3693 1.0556 5.7192 6.5276 1.0671 1.0385 1.0638 1.0372 1.0574 1.0993 1.0976 1.0984 1.0971 1.0978 1.0989 1.1073 1.0864 1.0921 1.0919 1.0992 1.0658 1.0661
irintensity: 0.3445 0.8735 0.5358 0.2781 9.6995 2.7369 1.8526 1.9841 7.0148 1.6444 3.6033 6.5486 3.7794 19.0235 107.1377 47.5754 3.8004 0.2394 3.9223 8.0759 1.8535 4.3094 2.6062 7.0715 83.0879 65.9358 16.6155 10.7333 5.5223 65.7311 11.4853 4.4038 6.0094 18.7029 19.4089 19.8809 66.8043 68.0980 11.4495 31.3157 0.8140 23.5562 83.8845 21.7416 14.3382 48.7608 21.6989 116.9028 11.4932 6.5342 0.7185 3.5295 90.6230 17.6196 39.6937 4.3017 3.5687 23.8512 1.4040 29.9786 25.9668 2.5675 8.9190 18.6935 16.3124 5.4903 12.5082 10.7158 2.1119 17.1796 4.0259 86.0553 21.1958 66.6083 94.0398 36.8362 42.7486 67.5832 35.9726 27.6030 16.4732 29.5745 46.7788 19.1044 23.5738 19.6515 13.6099 8.9232 20.0574 4.3197 11.5816 30.0898 4.6990
temp: 298.150 k
press: 1.00000 atm
elementType: 8 8 8 6 6 6 6 6 6 6 6 6 6 6 6 1 1 1 1 1 1 1 1 1 1 1 1 1 1 1 1 1 1
symmnumber: 1
zpe: 728035.1 jmol-1
zpe.correction: 0.277294 hartree
zpe.thermalcorrener: 0.292751 hartree
zpe.thermalcorrenthalpy: 0.293696 hartree
zpe.thermalcorrgfe: 0.234336 hartree
zpe.sumelectzpe: -692.552181 hartree
zpe.sumelectthermal: -692.536723 hartree
zpe.sumelectthermalent: -692.535779 hartree
zpe.sumelectthermalfe: -692.595139 hartree
dipole: -0.6919 1.5905 0.1452
dipole: 1.7405
quadrupole: -77.8176 -96.6304 -91.2097
quadrupole: -11.3114 1.3049 -0.7955
quadrupole: 10.7350 -8.0778 -2.6572 -11.3114 1.3049 -0.7955
hfenergy: -692.8294745 hartree
pointgroup: C01 [X(C12H18O3)]
dipole: -0.2878997 -0.6209679 -0.0207687 debye
polarizability: 185.5780735|0.0870171|139.0899267|-20.991227|-0.3859946|95.8216608 unknown
InChI: InChI=1S/C12H18O3/c1-10-4-3-5-11(6-10)15-9-12(2,7-13)8-14/h3-6,13-14H,7-9H2,1-2H3
charge 0 multiplicity 1
33 atoms
O  -0.217833 1.036975 0.620593
O  -2.463159 2.739212 0.115027
O  -2.195642 -2.262385 0.022703
C  -2.567571 0.220895 0.247386
C  -1.391406 0.383441 1.243337
C  -2.686682 1.501987 -0.638621
C  -2.336127 -0.985496 -0.698309
C  -3.856642 0.029919 1.086612
C  0.929054 0.286636 0.273652
C  2.061903 1.066673 -0.066537
C  0.987392 -1.126768 0.242189
C  3.275891 0.451022 -0.44298
C  2.208519 -1.73814 -0.12998
C  3.340334 -0.969465 -0.469448
C  4.493672 1.286409 -0.801546
H  -1.691833 1.072523 2.050808
H  -1.115349 -0.590862 1.682117
H  -3.710892 1.589142 -1.041021
H  -1.975348 1.435333 -1.48797
H  -3.160214 -1.043938 -1.441531
H  -1.384176 -0.87179 -1.242863
H  -4.704997 -0.276741 0.444986
H  -4.129791 0.981746 1.575853
H  -3.729903 -0.730438 1.881827
H  -1.491067 2.778096 0.318014
H  -3.071458 -2.515995 0.407892
H  1.976263 2.15796 -0.025024
H  0.118415 -1.751078 0.474271
H  2.261975 -2.832299 -0.161084
H  4.274819 -1.464975 -0.758082
H  4.879656 1.020835 -1.80337
H  4.261506 2.365077 -0.803107
H  5.317489 1.120188 -0.081695
