program: Gaussian 09
title: 000199133
version: EM64L-G09RevD.01
frameworkgroup: C1[X(C10H11N5O2S)]
method: RPBEPBE
basis: SDD
operation: Freq
keyword: #p
keyword: freq=noraman
keyword: PBEPBE/SDD
title: #p freq=noraman PBEPBE/SDD
converged: NO YES NO NO
title: Mulliken charges:
elementType: S O O N N N N N C C C C C C C C C C H H H H H H H H H H H
charge: 0.330926 -0.294109 -0.260266 -0.165907 -0.147681 -0.225075 -0.083756 0.016852 0.149668 0.070111 -0.304627 0.199936 0.212405 -0.208055 -0.711911 -0.608740 -0.600624 -0.360238 0.250919 0.271650 0.276822 0.350739 0.292154 0.272105 0.249956 0.250640 0.268227 0.253301 0.254580
chargesum: 0.00000
title: Mulliken charges with hydrogens summed into heavy atoms:
elementType: S O O N N N N N C C C C C C C C C C
charge: 0.330926 -0.294109 -0.260266 -0.165907 -0.147681 -0.225075 -0.083756 0.016852 0.149668 0.070111 0.217941 0.199936 0.212405 0.068767 -0.069018 0.163959 0.175484 -0.360238
polarizability: 2.31612244e+02 1.27487502e+01 1.79656591e+02 1.16489134e+01 -7.83328773e-01 8.40702459e+01
1716.lowfreq: -10.4567 -6.9054 -4.4000 -0.0021 -0.0007 0.0005 24.8312 35.2290 44.4101
frequency: 24.7710 35.1962 44.4011 73.2852 90.0864 96.3780 107.0543 116.4634 147.4796 156.5334 166.9245 205.5811 225.1069 282.1124 293.8044 302.5766 349.5656 377.8721 380.2665 386.5737 410.1216 430.8050 442.1782 480.3229 537.6106 601.8015 622.3264 623.7750 667.1460 671.3933 704.3428 744.1637 752.2977 777.7287 790.4811 812.8573 908.2742 956.8606 1006.8783 1017.9596 1043.2005 1049.5039 1129.3445 1132.5004 1141.9013 1166.9071 1194.8648 1220.4251 1232.1286 1257.1575 1260.2633 1278.1161 1302.7671 1345.9263 1356.5189 1374.8444 1410.5567 1424.5468 1428.9081 1438.6589 1460.7060 1472.6985 1476.2959 1478.7909 1479.2471 1504.5831 1572.3755 1615.5171 1643.2211 2102.3019 3011.3429 3014.9194 3025.4793 3041.0625 3091.8430 3102.1092 3107.6146 3133.2674 3141.8026 3142.9425 3238.8570
redmass: 8.7907 8.6969 8.2716 5.4715 1.1181 2.9249 1.5460 2.3183 2.6424 3.7780 6.7003 3.9124 7.8807 4.1621 4.3982 3.9663 3.6049 6.6327 12.6170 8.1238 6.3335 7.4813 8.1588 7.5009 5.8793 4.2815 8.7360 9.9521 8.0671 7.0532 10.7998 7.0830 3.5000 1.9550 2.4947 1.5091 4.0465 6.5003 2.6393 1.7242 4.1141 3.2361 1.3048 1.2997 1.5881 2.1349 2.9530 2.8519 2.0219 3.0019 1.4222 1.7279 6.8811 1.8183 2.3273 2.1611 1.8395 1.4859 1.3543 1.1200 1.3738 1.0445 1.1344 1.0662 1.0750 2.5811 8.2604 11.0606 9.7918 12.7290 1.0335 1.0329 1.0598 1.0571 1.1057 1.1027 1.1022 1.1097 1.1025 1.1015 1.0992
irintensity: 3.5817 3.5597 0.6782 0.2847 0.0221 0.1337 2.0679 2.8301 1.8470 4.3170 15.5293 9.3040 3.8497 1.7717 0.3542 1.4249 10.2005 11.2444 0.2901 16.4939 4.9903 15.8506 5.2535 15.8174 1.4103 12.1195 1.4494 1.7906 25.5218 12.2791 10.5064 9.4351 2.3376 4.5231 7.2414 21.7698 4.4528 26.8030 54.2552 17.8802 2.7389 10.7170 0.2461 0.1834 26.3836 50.8482 56.6786 25.4807 16.8449 26.5224 14.6750 14.6957 23.8231 38.2243 7.3509 12.1084 63.1561 75.1246 90.6967 48.9285 87.9847 20.4733 29.2043 17.8181 10.6776 122.8531 10.7600 737.6202 309.7711 25.8224 32.4835 23.1204 10.8999 12.1484 2.8702 15.4632 15.1147 8.5227 0.7437 0.3801 2.1707
temp: 298.150 k
press: 1.00000 atm
elementType: 16 8 8 7 7 7 7 7 6 6 6 6 6 6 6 6 6 6 1 1 1 1 1 1 1 1 1 1 1
symmnumber: 1
zpe: 555470.3 jmol-1
zpe.correction: 0.211567 hartree
zpe.thermalcorrener: 0.229349 hartree
zpe.thermalcorrenthalpy: 0.230294 hartree
zpe.thermalcorrgfe: 0.163831 hartree
zpe.sumelectzpe: -1208.627296 hartree
zpe.sumelectthermal: -1208.609514 hartree
zpe.sumelectthermalent: -1208.608570 hartree
zpe.sumelectthermalfe: -1208.675033 hartree
dipole: -1.1754 0.1107 0.0648
dipole: 1.1824
quadrupole: -144.1076 -115.5506 -110.0764
quadrupole: -8.8701 -0.0826 1.5323
quadrupole: -20.8627 7.6943 13.1685 -8.8701 -0.0826 1.5323
hfenergy: -1208.8388635 hartree
pointgroup: C01 [X(C10H11N5O2S1)]
dipole: 0.464604 0.0192641 0.0134373 debye
polarizability: 227.6446033|-18.8188569|178.5405857|19.7097418|15.0622403|89.153892 unknown
InChI: InChI=1S/C10H11N5O2S/c1-13-8-7(9(16)14(2)10(13)17)15(6-12-8)3-4-18-5-11/h6H,3-4H2,1-2H3
charge 0 multiplicity 1
29 atoms
S  -4.47597 -0.981248 -0.308403
O  -0.167593 -2.043681 -0.819202
O  4.256311 -0.986862 0.427343
N  -0.774737 0.987695 -0.346188
N  2.689855 0.76092 0.453022
N  2.051845 -1.479832 -0.20143
N  0.856845 2.423975 0.374492
N  -5.848429 1.614176 -0.087396
C  0.405832 0.232494 -0.216767
C  1.380097 1.145408 0.221542
C  -2.092688 0.499908 -0.799018
C  0.675626 -1.162958 -0.449159
C  3.074886 -0.585098 0.240031
C  -0.447156 2.285406 0.023295
C  -2.717681 -0.45956 0.231306
C  3.690715 1.74519 0.913295
C  2.488476 -2.880911 -0.410331
C  -5.269329 0.566927 -0.167932
H  -2.737259 1.383372 -0.951614
H  -1.974783 -0.023006 -1.762973
H  -1.173394 3.095212 0.016807
H  -2.161321 -1.410986 0.264065
H  -2.79565 -0.011162 1.233264
H  4.648156 1.217058 1.027337
H  3.376737 2.1799 1.876647
H  3.788535 2.557644 0.174316
H  1.612523 -3.451682 -0.750584
H  2.880826 -3.298412 0.531139
H  3.291222 -2.915786 -1.164405
