program: Gaussian 09
title: 000199132
version: EM64L-G09RevD.01
frameworkgroup: C1[X(C16H21NO)]
method: RPBEPBE
basis: SDD
operation: Freq
keyword: #p
keyword: freq=noraman
keyword: PBEPBE/SDD
title: #p freq=noraman PBEPBE/SDD
converged: NO YES NO NO
title: Mulliken charges:
elementType: O N C C C C C C C C C C C C C C C C H H H H H H H H H H H H H H H H H H H H H
charge: -0.440634 -0.042204 0.257355 -0.178572 -0.492279 -0.503306 -0.460058 0.361462 -0.412950 -0.474589 -0.396703 -0.390770 -0.603164 0.222991 -0.570496 -0.344180 0.273320 -0.429081 0.213843 0.196797 0.221553 0.197201 0.195160 0.209109 0.217578 0.233041 0.195328 0.217314 0.213810 0.220644 0.188551 0.185529 0.200052 0.240880 0.221063 0.257124 0.229564 0.217732 0.351984
chargesum: 0.00000
title: Mulliken charges with hydrogens summed into heavy atoms:
elementType: O N C C C C C C C C C C C C C C C C
charge: -0.088650 -0.042204 0.257355 0.035271 -0.073930 -0.110945 -0.033372 0.361462 0.015419 -0.043464 0.012492 -0.005188 -0.141221 0.222991 -0.313372 -0.114616 0.273320 -0.211349
polarizability: 2.00550661e+02 3.45487717e+00 1.63707522e+02 -4.48770695e+00 1.50839075e+01 1.47522030e+02
1716.lowfreq: -21.4056 -0.0003 0.0003 0.0006 6.7103 16.5668 61.8780 89.8800 142.3104
frequency: 61.6956 89.7887 142.2949 159.7008 187.5012 220.4245 237.4130 265.4230 280.5621 318.5740 333.4046 343.2498 355.6842 377.0780 398.8935 415.8587 427.8333 453.0101 464.9706 481.7438 501.1822 512.6080 552.1852 563.0583 613.5100 625.4453 684.0008 724.7576 765.5292 771.1553 788.6306 815.0840 825.6655 845.2082 848.1066 870.7928 872.3776 886.8320 912.6098 921.5615 942.8203 949.9672 963.7871 993.4602 1019.9298 1046.6870 1053.7772 1061.9429 1070.3405 1094.5132 1101.9622 1110.9411 1131.0805 1139.7941 1149.5018 1156.2131 1170.8298 1186.2354 1198.5629 1201.9676 1236.7047 1241.6034 1245.6696 1260.2825 1265.8104 1284.3161 1302.3451 1310.0522 1313.4823 1321.6349 1331.0306 1336.3996 1339.2594 1341.7853 1343.7014 1355.3106 1368.0545 1383.8958 1441.3103 1451.2876 1457.6024 1460.4376 1462.1649 1463.9529 1467.5225 1472.4044 1479.5205 1489.1119 1584.5548 1627.2897 2951.3554 2954.6477 2957.4548 2962.2643 2964.0249 2970.9622 2978.6254 2984.1422 2985.8351 3014.5738 3018.0036 3020.7127 3028.5793 3033.7142 3038.1700 3049.2893 3050.9726 3101.3921 3125.0501 3158.5155 3583.2319
redmass: 4.5298 4.0884 3.0191 2.7127 2.8259 3.9829 3.1079 2.2247 2.3943 2.7733 2.5547 1.1223 2.4873 3.4467 3.5296 3.5061 3.4508 3.0602 2.3757 2.6151 3.4783 3.5376 2.4376 2.1998 4.5250 3.3382 6.1112 3.2473 4.0712 1.9481 1.4605 2.5866 2.0455 2.3799 1.8966 1.7739 2.9722 1.5543 1.5878 1.4605 2.3939 2.4743 2.1299 2.0815 2.1380 1.9858 1.7625 2.2767 2.6456 2.2890 1.7812 1.9503 2.5609 1.5838 1.3423 1.5174 1.5616 1.8998 2.1005 1.6025 1.6501 1.8013 1.5576 1.3505 1.5706 1.3920 1.3560 1.5048 1.4671 1.4478 1.3812 1.3575 1.3425 1.3958 1.4236 1.4321 1.4469 5.0928 2.6796 1.0989 1.1427 1.0882 1.0952 1.0902 1.1099 1.1250 1.1237 2.2658 7.0500 6.4273 1.0630 1.0740 1.0685 1.0633 1.0661 1.0621 1.0627 1.0629 1.0608 1.0977 1.0964 1.0979 1.0953 1.1003 1.1025 1.1033 1.1029 1.0864 1.0969 1.0903 1.0660
irintensity: 0.0462 0.8339 0.5114 0.4052 2.8390 3.1704 1.2711 0.0231 1.1306 1.3253 1.5818 134.3765 0.5358 3.1804 0.2837 4.3275 3.1058 4.1224 6.3194 3.2668 5.8316 6.7594 2.4665 0.9961 19.3798 3.8133 0.6188 3.4645 3.5591 0.8175 35.1085 7.0784 5.4650 3.8575 11.8331 14.8051 27.3653 15.4725 7.8107 1.6244 20.2286 11.8380 12.9642 3.7114 0.8030 18.0166 9.2814 1.4375 11.1520 16.2443 9.8427 5.6629 5.9399 58.0246 129.4273 34.0213 0.4689 2.1494 1.1303 4.6249 4.0398 8.0131 6.6457 1.1474 28.8967 2.0782 0.5629 6.9014 4.8378 2.8070 1.4399 3.1004 0.7777 0.3663 3.2045 10.6306 5.0023 18.1088 11.0986 9.9173 15.7143 11.5192 3.3627 5.1013 7.8823 21.5998 19.0029 51.5792 37.4995 64.6066 14.5189 21.4557 35.0484 33.4825 78.6299 65.1473 29.1262 53.7243 28.8216 11.6341 15.1224 70.8237 66.9541 45.2330 37.5784 6.8799 152.1815 14.4081 29.6797 4.2556 32.2135
temp: 298.150 k
press: 1.00000 atm
elementType: 8 7 6 6 6 6 6 6 6 6 6 6 6 6 6 6 6 6 1 1 1 1 1 1 1 1 1 1 1 1 1 1 1 1 1 1 1 1 1
symmnumber: 1
zpe: 885414.4 jmol-1
zpe.correction: 0.337237 hartree
zpe.thermalcorrener: 0.351867 hartree
zpe.thermalcorrenthalpy: 0.352812 hartree
zpe.thermalcorrgfe: 0.297449 hartree
zpe.sumelectzpe: -750.924132 hartree
zpe.sumelectthermal: -750.909501 hartree
zpe.sumelectthermalent: -750.908557 hartree
zpe.sumelectthermalfe: -750.963920 hartree
dipole: 0.9085 -0.8106 -0.2409
dipole: 1.2412
quadrupole: -98.8709 -107.4271 -108.7012
quadrupole: -5.8954 -8.5672 0.2708
quadrupole: 6.1288 -2.4274 -3.7015 -5.8954 -8.5672 0.2708
hfenergy: -751.2613686 hartree
pointgroup: C01 [X(C16H21N1O1)]
dipole: 0.3692046 0.3042771 0.0978236 debye
polarizability: 200.1835319|-4.9653707|163.8818406|5.2624758|14.9598514|147.7148402 unknown
InChI: InChI=1S/C16H21NO/c18-13-6-5-12-11-17-9-3-8-16(14(12)10-13)7-2-1-4-15(16)17/h5-6,10,15,18H,1-4,7-9,11H2
charge 0 multiplicity 1
39 atoms
O  4.083209 -1.138408 -0.696424
N  -1.788554 1.441453 0.677685
C  -0.831902 -0.381867 -0.766708
C  -1.927841 0.007428 0.288814
C  -1.058294 0.517401 -2.032888
C  -1.029911 -1.873111 -1.160417
C  -1.937624 -0.934963 1.511336
C  0.561298 -0.072933 -0.181698
C  -1.057996 2.027721 -1.700734
C  -2.009572 2.320935 -0.506825
C  -1.037076 -2.826201 0.056031
C  -2.125045 -2.406887 1.074353
C  -0.502422 1.68953 1.378257
C  0.713379 0.950181 0.80334
C  1.716101 -0.740409 -0.655024
C  2.004132 1.253095 1.295183
C  2.996283 -0.416076 -0.161763
C  3.153568 0.586927 0.823343
H  -2.913176 -0.089857 -0.216421
H  -2.039505 0.23982 -2.474178
H  -0.285013 0.286913 -2.791864
H  -0.269498 -2.188232 -1.901094
H  -2.008833 -1.952066 -1.679461
H  -2.749372 -0.618065 2.193163
H  -0.985713 -0.849317 2.070347
H  -0.031662 2.359127 -1.453773
H  -1.381884 2.610272 -2.586015
H  -1.915301 3.374397 -0.182885
H  -3.05913 2.168786 -0.830161
H  -0.044484 -2.810717 0.54782
H  -1.211673 -3.865635 -0.283804
H  -3.126468 -2.530161 0.610488
H  -2.099422 -3.070165 1.960344
H  -0.621768 1.401317 2.442735
H  -0.319297 2.78114 1.376415
H  1.649123 -1.526922 -1.412561
H  2.116153 2.032173 2.060535
H  4.148019 0.844253 1.211843
H  4.932471 -0.843979 -0.283533
