program: Gaussian 09
title: 000199172
version: EM64L-G09RevD.01
frameworkgroup: C1[X(C16H18N6O2S)]
method: RPBEPBE
basis: SDD
operation: Freq
keyword: #p
keyword: freq=noraman
keyword: PBEPBE/SDD
title: #p freq=noraman PBEPBE/SDD
converged: YES YES NO NO
title: Mulliken charges:
elementType: S O O N N N N N N C C C C C C C C C C C C C C C C H H H H H H H H H H H H H H H H H H
charge: 0.189064 -0.286236 -0.269154 -0.159271 -0.147931 -0.225231 -0.092795 -0.079134 -0.613213 0.145473 0.068109 -0.310898 0.190501 -0.209638 0.209383 -0.704286 -0.610916 -0.602170 -0.129953 0.265452 -0.381869 -0.414147 -0.200564 -0.209401 -0.256617 0.263731 0.261471 0.279600 0.322357 0.294174 0.269932 0.247545 0.248367 0.267429 0.250317 0.251164 0.352391 0.331048 0.248439 0.261897 0.228524 0.226496 0.230562
chargesum: 0.00000
title: Mulliken charges with hydrogens summed into heavy atoms:
elementType: S O O N N N N N N C C C C C C C C C C C C C C C C
charge: 0.189064 -0.286236 -0.269154 -0.159271 -0.147931 -0.225231 -0.092795 -0.079134 0.070225 0.145473 0.068109 0.214304 0.190501 0.069962 0.209383 -0.087754 0.154928 0.166740 -0.129953 0.265452 -0.133430 -0.152251 0.027960 0.017094 -0.026055
polarizability: 3.24942703e+02 2.90989233e+01 2.75754943e+02 -2.89464386e+01 1.12637507e+01 1.38484021e+02
1716.lowfreq: -3.5815 -0.0001 0.0007 0.0015 3.0675 5.5360 14.2496 16.4399 25.6498
frequency: 13.7974 16.1112 25.5946 41.8599 46.9769 64.0942 81.9186 88.7408 92.6967 102.1220 105.0358 116.9751 153.7236 165.1903 177.0842 198.0932 215.4867 248.7630 286.0159 292.6074 301.5720 338.7874 348.2140 362.1171 377.4061 385.6384 399.6830 407.8903 411.1277 423.7318 431.8110 478.1321 481.5692 504.4962 538.0530 557.2580 609.0542 610.0038 617.1204 630.7863 669.2732 694.4744 699.4811 705.1178 711.6362 737.9705 746.8928 768.1097 771.9521 783.3406 788.4793 819.9153 843.9759 907.7041 908.9935 957.5624 969.2122 983.3671 987.5155 1005.6582 1014.7558 1019.3857 1045.5141 1048.5844 1051.1733 1076.1426 1130.1622 1132.2453 1148.2539 1165.6698 1169.1571 1178.8194 1197.7897 1222.4124 1231.4634 1233.1332 1261.6461 1265.0015 1270.5911 1281.5212 1299.6299 1307.6927 1347.6194 1349.7970 1369.1268 1374.5736 1409.5594 1413.6747 1423.4066 1427.0619 1437.1645 1457.1101 1473.0757 1473.3906 1476.9739 1477.3551 1479.7708 1506.5209 1569.9740 1575.7716 1601.7521 1610.8296 1612.5454 1645.0193 1650.7704 3008.6316 3012.8375 3038.3058 3048.3029 3098.4235 3104.5004 3109.8617 3119.2164 3129.7242 3132.7978 3139.3098 3140.1607 3140.8419 3154.2486 3167.8471 3241.2487 3518.8323 3665.9838
redmass: 6.1400 5.8901 4.0803 6.0950 6.1155 4.7505 1.0360 6.6037 3.3692 3.6500 1.3220 3.5991 4.2113 6.4825 2.4261 6.1053 3.8446 4.5020 3.9568 4.2419 4.1879 6.2387 3.4461 3.3019 6.9101 4.7755 2.0869 2.6963 2.8108 5.2336 7.4073 1.4029 3.8922 3.1868 6.0220 7.6644 5.7006 4.6174 6.2584 7.1393 9.0175 3.6143 4.1352 9.5317 2.1479 1.9619 4.9354 2.7162 2.0227 5.4007 3.9335 1.5019 1.2444 1.4367 3.9066 6.1169 1.3713 5.7231 1.3010 2.5881 1.8522 2.3125 3.9914 1.9900 3.5154 1.5563 1.3013 1.3017 1.8050 2.0455 1.0596 1.1155 2.5492 3.1679 2.4653 2.1810 3.6393 4.4877 1.2423 1.7671 7.3968 1.4333 2.6482 1.3904 5.5268 2.4930 1.7711 1.1058 1.5142 1.3631 2.4179 1.4644 1.0489 2.2509 1.1147 1.0458 1.1176 2.6296 8.1841 5.9953 3.6070 1.6442 6.7840 8.6564 5.2741 1.0334 1.0328 1.0581 1.0572 1.1025 1.1021 1.1062 1.0858 1.0869 1.1094 1.1024 1.1014 1.0934 1.0950 1.1012 1.0993 1.0449 1.1042
irintensity: 0.1056 0.3097 2.2152 0.0809 1.2822 2.9559 0.1243 0.9287 0.6240 0.1808 1.4508 4.6757 2.6261 11.0619 1.9863 6.2705 13.3706 1.6702 1.4232 0.1705 0.5040 14.6875 10.9134 9.4196 10.6275 24.9036 12.0926 11.0568 10.5249 10.0869 10.8375 167.3770 61.6224 25.2894 0.9074 7.8654 1.3574 16.4954 9.1611 0.2019 0.2087 4.7916 54.3978 20.4322 31.5813 10.3833 10.2871 3.2257 65.6911 20.8877 10.4997 18.2678 1.1872 5.0034 5.5195 36.8444 0.5777 0.4050 0.4381 52.9467 21.4384 9.4667 8.5233 1.6599 4.7585 12.8899 0.3641 0.1243 10.4708 49.2569 0.3783 2.5499 95.2404 30.3083 39.8362 4.8014 27.5992 295.2574 7.6351 15.0783 24.2010 12.1653 33.7582 11.5783 1.5100 17.4298 40.6314 11.9662 98.4862 91.1812 2.8467 110.3047 19.2667 60.7560 21.2513 15.4303 19.2958 117.2679 3.1571 11.3143 295.6857 201.2256 517.1084 91.7792 841.4994 35.0332 28.3648 0.0239 13.6309 16.9512 17.0252 0.8850 7.9467 1.0711 1.0385 0.8202 0.5284 20.1552 29.7780 18.2959 1.6940 50.2660 48.8000
temp: 298.150 k
press: 1.00000 atm
elementType: 16 8 8 7 7 7 7 7 7 6 6 6 6 6 6 6 6 6 6 6 6 6 6 6 6 1 1 1 1 1 1 1 1 1 1 1 1 1 1 1 1 1 1
symmnumber: 1
zpe: 867846.7 jmol-1
zpe.correction: 0.330545 hartree
zpe.thermalcorrener: 0.354769 hartree
zpe.thermalcorrenthalpy: 0.355713 hartree
zpe.thermalcorrgfe: 0.273107 hartree
zpe.sumelectzpe: -1495.750628 hartree
zpe.sumelectthermal: -1495.726404 hartree
zpe.sumelectthermalent: -1495.725460 hartree
zpe.sumelectthermalfe: -1495.808066 hartree
dipole: -5.8849 0.5729 0.1951
dipole: 5.9159
quadrupole: -148.5788 -150.9872 -151.5557
quadrupole: -6.4950 -1.5376 0.9170
quadrupole: 1.7951 -0.6133 -1.1818 -6.4950 -1.5376 0.9170
hfenergy: -1496.0811732 hartree
pointgroup: C01 [X(C16H18N6O2S1)]
dipole: -2.3034325 0.3337912 -0.0018135 debye
polarizability: 314.694243|-31.6920904|169.5541876|-47.2716314|-50.8889414|254.9332373 unknown
InChI: InChI=1S/C16H18N6O2S/c1-20-13-12(14(23)21(2)16(20)24)22(10-18-13)8-9-25-15(17)19-11-6-4-3-5-7-11/h3-7,10H,8-9,17H2,1-2H3
charge 0 multiplicity 1
43 atoms
S  -1.945539 1.011209 -2.808832
O  2.643916 1.018696 -2.377998
O  6.143331 -1.115202 -0.041573
N  0.914813 0.446506 0.163785
N  4.064981 -0.969435 1.039929
N  4.387012 -0.050424 -1.173025
N  1.784492 -0.67503 1.961788
N  -3.142899 0.213827 -0.462229
N  -4.564943 1.131984 -2.187279
C  2.253193 0.152567 -0.147618
C  2.752831 -0.526394 0.977225
C  -0.067969 1.132099 -0.702424
C  3.04025 0.43306 -1.319759
C  0.686423 -0.075271 1.426788
C  4.937342 -0.737284 -0.049491
C  -0.567918 0.197244 -1.820627
C  4.558846 -1.679282 2.236181
C  5.325649 0.171829 -2.29725
C  -3.356736 0.738787 -1.63627
C  -4.14531 0.03701 0.531115
C  -4.229889 -1.218785 1.194411
C  -5.010743 1.093187 0.946624
C  -5.17093 -1.420738 2.225494
C  -5.941512 0.884126 1.98834
C  -6.034727 -0.373558 2.628063
H  -0.918704 1.429156 -0.068597
H  0.405931 2.025359 -1.140613
H  -0.280793 -0.001713 1.918704
H  0.227904 -0.01323 -2.55291
H  -0.985103 -0.730367 -1.398593
H  5.616029 -1.926678 2.062841
H  3.972374 -2.599011 2.398378
H  4.456786 -1.035579 3.12568
H  4.773541 0.707023 -3.083341
H  5.699432 -0.793965 -2.674687
H  6.189052 0.765727 -1.955845
H  -5.421344 1.018338 -1.645103
H  -4.63334 1.418359 -3.161595
H  -3.550493 -2.019975 0.885499
H  -4.917492 2.084556 0.48645
H  -5.226312 -2.396621 2.721184
H  -6.590044 1.709178 2.305235
H  -6.758989 -0.532283 3.434045
