program: Gaussian 09
title: 000199143
version: EM64L-G09RevD.01
frameworkgroup: C1[X(C17H21N5O2)]
method: RPBEPBE
basis: SDD
operation: Freq
keyword: #p
keyword: freq=noraman
keyword: PBEPBE/SDD
title: #p freq=noraman PBEPBE/SDD
converged: YES YES NO NO
title: Mulliken charges:
elementType: O O N N N N N C C C C C C C C C C C C C C C C C H H H H H H H H H H H H H H H H H H H H H
charge: -0.270285 -0.266756 -0.098144 -0.128124 -0.153483 -0.098711 -0.363869 -0.349438 -0.350822 -0.397759 -0.389022 -0.495198 0.509669 0.087403 -0.485836 -0.458313 0.204889 0.157519 -0.326663 0.224855 -0.202267 -0.295908 -0.317379 -0.631233 0.197537 0.228343 0.207540 0.186561 0.213878 0.266943 0.254566 0.210748 0.197364 0.218595 0.287844 0.236876 0.248488 0.234590 0.235302 0.231795 0.231661 0.313435 0.225232 0.233638 0.233938
chargesum: 0.00000
title: Mulliken charges with hydrogens summed into heavy atoms:
elementType: O O N N N N N C C C C C C C C C C C C C C C C C
charge: -0.270285 -0.266756 -0.098144 -0.128124 -0.153483 -0.098711 -0.050434 0.076442 0.043279 0.083062 0.076291 -0.079239 0.509669 0.087403 -0.197992 -0.221437 0.204889 0.157519 -0.078176 0.224855 0.267626 -0.064113 -0.085718 0.061575
polarizability: 3.52545184e+02 -2.67553542e+01 1.84581467e+02 3.52306532e+00 1.92428562e+00 1.72318959e+02
1716.lowfreq: -63.4365 -2.6059 -0.0010 -0.0006 0.0002 6.4267 9.2221 16.5348 27.3865
frequency: -63.4324 15.7456 27.1073 32.3016 43.6695 62.1755 95.4069 112.4341 133.1348 140.7681 148.8288 172.3050 202.3013 220.8821 231.2049 248.9957 273.2338 284.7358 301.1601 327.1067 348.8545 405.3821 407.5769 422.8867 428.3169 443.6361 473.4210 510.1160 514.2722 532.0112 543.6471 586.7674 592.1035 607.7317 626.8276 678.6435 682.2600 716.7997 720.8090 752.7789 761.8338 765.1550 778.4981 790.8272 811.9390 840.4240 842.9096 846.8710 892.4140 912.9648 917.9815 929.6111 938.3903 952.6298 978.5504 984.1144 1000.3187 1005.4221 1052.8264 1056.1593 1057.9769 1065.2083 1078.6387 1086.7202 1104.7432 1119.4060 1122.1547 1124.1044 1140.1417 1141.4258 1172.0963 1173.1126 1193.5002 1200.4970 1231.5074 1249.1514 1254.6774 1264.6081 1279.7507 1291.4291 1299.6685 1317.1546 1324.7446 1336.7535 1348.1630 1355.0270 1360.0092 1365.1925 1377.1445 1384.8011 1408.8566 1439.6773 1442.3092 1453.9065 1458.2110 1461.8350 1462.9017 1468.2348 1472.9875 1477.6331 1480.1042 1486.8855 1501.5042 1522.7281 1563.6065 1581.0630 1610.7390 1630.5278 2847.2269 2857.3397 2868.9213 2955.3331 2968.2333 2972.2114 2982.8580 3008.6922 3021.7893 3023.7417 3047.6421 3084.9725 3099.4163 3100.6073 3102.4423 3122.5727 3133.9296 3174.8372 3179.4733 3188.9264 3568.4649
redmass: 2.3244 5.0134 5.5191 5.0798 5.5539 3.7503 3.5424 3.4353 1.7343 4.1069 2.4638 3.6357 3.3119 5.7977 4.9522 4.4159 2.5862 2.8348 2.8690 3.2413 4.7051 2.0822 3.7211 2.9986 3.5962 2.3799 2.9014 1.3483 5.8111 5.5210 5.0803 4.6270 4.7672 5.4507 2.1060 9.5072 4.3403 4.8145 5.1496 5.3753 2.6061 3.5741 4.5576 2.3720 1.4588 3.5884 6.5719 1.8720 1.5708 2.6102 6.4253 1.4005 2.2251 1.3953 4.9188 3.2760 2.2495 2.0851 1.8506 2.6838 2.6116 1.4594 1.7579 1.7555 2.2474 1.0375 1.7953 1.2778 2.1668 2.7124 1.8017 2.0449 1.4434 1.2645 1.6282 4.9417 1.3703 1.6368 1.4582 1.6416 3.6474 1.8747 1.3742 1.3825 2.2434 1.4193 1.4630 1.2857 1.7794 1.8217 2.5556 4.6003 1.2371 1.1272 1.1255 1.1019 1.1898 1.0414 1.3191 1.6209 1.9481 1.2334 1.2559 3.2285 5.3761 5.6986 7.9476 8.2998 1.0703 1.0707 1.0691 1.0374 1.0683 1.0688 1.0869 1.0533 1.1012 1.0897 1.0895 1.1189 1.0964 1.0929 1.0939 1.0911 1.0897 1.0928 1.0953 1.0949 1.0769
irintensity: 14.6729 0.5945 0.1550 0.5100 0.1227 0.9979 5.0227 0.6850 1.1021 1.8288 0.8866 0.5917 1.4529 0.1374 0.0342 1.5825 1.7484 0.1425 4.9453 7.6590 5.5441 1.6750 5.1680 9.7777 2.7310 28.3185 0.7213 84.9598 2.8306 13.7663 4.7072 6.4157 4.5470 3.1108 4.3111 0.9927 0.2681 1.2140 4.7628 8.1717 0.8363 15.8797 18.4082 60.5800 44.6169 16.5731 28.0345 5.6658 22.9353 5.2575 5.4296 3.0637 0.3981 0.5367 199.1372 13.8836 78.8637 30.1889 0.9895 10.0802 14.4869 4.4034 8.3043 3.3334 21.7479 0.0399 21.6516 1.7080 16.4003 11.8647 15.8033 17.0628 2.2379 4.7981 41.4598 257.9919 7.2233 122.6836 10.8703 49.0716 1.6073 103.9201 10.6394 9.7085 66.7487 97.5969 4.4195 1.8027 6.4764 82.1429 8.0232 58.9931 30.2668 44.6253 74.9041 35.5772 34.5843 11.9768 69.6594 57.4204 55.0957 18.4705 189.9713 158.1156 704.1886 608.2747 4.3325 0.1909 36.6841 57.3552 148.8923 101.2003 24.7316 102.2394 21.3993 135.8424 46.3773 61.3058 37.5963 35.4084 23.4279 6.0398 7.4503 29.4958 10.5782 2.0307 6.8823 13.5366 37.0939
temp: 298.150 k
press: 1.00000 atm
elementType: 8 8 7 7 7 7 7 6 6 6 6 6 6 6 6 6 6 6 6 6 6 6 6 6 1 1 1 1 1 1 1 1 1 1 1 1 1 1 1 1 1 1 1 1 1
symmnumber: 1
zpe: 958095.3 jmol-1
zpe.correction: 0.364919 hartree
zpe.thermalcorrener: 0.385669 hartree
zpe.thermalcorrenthalpy: 0.386613 hartree
zpe.thermalcorrgfe: 0.313194 hartree
zpe.sumelectzpe: -1082.811598 hartree
zpe.sumelectthermal: -1082.790848 hartree
zpe.sumelectthermalent: -1082.789904 hartree
zpe.sumelectthermalfe: -1082.863324 hartree
dipole: 2.4889 -2.0450 -0.3087
dipole: 3.2361
quadrupole: -104.0777 -136.1262 -140.2328
quadrupole: -11.7095 0.0535 0.0824
quadrupole: 22.7345 -9.3140 -13.4206 -11.7095 0.0535 0.0824
hfenergy: -1083.1765172 hartree
pointgroup: C01 [X(C17H21N5O2)]
dipole: -0.974046 -0.7958478 0.1969746 debye
polarizability: 352.3212759|27.6428162|184.4109166|-0.3792793|-3.1658805|172.713418 unknown
InChI: InChI=1S/C17H21N5O2/c1-18-16-4-5-19-17(20-16)22-8-6-21(7-9-22)11-13-2-3-14-15(10-13)24-12-23-14/h2-5,10,18H,6-9,11-12H2,1H3
charge 0 multiplicity 1
45 atoms
O  5.305623 1.273708 1.484094
O  6.770171 0.830055 -0.371044
N  0.614696 -0.971743 0.260421
N  -1.953662 0.285991 0.433621
N  -4.250531 -0.221222 0.570672
N  -3.435558 1.61809 -0.830961
N  -6.510834 -0.747775 0.736529
C  0.231099 0.094618 -0.701761
C  -0.574011 -1.745364 0.69821
C  -0.797201 1.0497 -0.067345
C  -1.612289 -0.811593 1.352487
C  1.701999 -1.840103 -0.248597
C  3.043754 -1.119981 -0.349937
C  -3.252699 0.56471 0.049371
C  3.441642 -0.230952 0.692891
C  3.90983 -1.369464 -1.441704
C  4.699446 0.359214 0.582588
C  5.561121 0.099521 -0.505245
C  5.194548 -0.763253 -1.539021
C  -5.53577 0.063744 0.193155
C  6.638674 1.584897 0.904456
C  -4.72809 1.867732 -1.17948
C  -5.833059 1.134614 -0.707514
C  -7.939542 -0.615571 0.46299
H  -0.202391 -0.342778 -1.636848
H  1.137204 0.662026 -0.97929
H  -0.251046 -2.504782 1.435397
H  -1.059014 -2.279161 -0.158804
H  -0.317815 1.583715 0.778673
H  -1.16428 1.785886 -0.798063
H  -2.536606 -1.354747 1.600446
H  -1.177466 -0.38862 2.281708
H  1.453352 -2.288386 -1.244434
H  1.795397 -2.686764 0.462131
H  2.762488 -0.023353 1.523703
H  3.584082 -2.047861 -2.238588
H  5.860339 -0.956155 -2.38389
H  7.422825 1.246629 1.604265
H  6.693836 2.666027 0.688602
H  -4.875611 2.701906 -1.87606
H  -6.850011 1.378605 -1.018356
H  -6.170784 -1.473054 1.368771
H  -8.487681 -1.386466 1.028561
H  -8.168385 -0.754312 -0.612464
H  -8.329187 0.374975 0.771463
