program: Gaussian 09
title: 000199212
version: EM64L-G09RevD.01
frameworkgroup: C1[X(C18H20N4O3S)]
method: RPBEPBE
basis: SDD
operation: Freq
keyword: #p
keyword: freq=noraman
keyword: PBEPBE/SDD
title: #p freq=noraman PBEPBE/SDD
converged: NO YES NO NO
title: Mulliken charges:
elementType: S O O O N N N N C C C C C C C C C C C C C C C C C C H H H H H H H H H H H H H H H H H H H H
charge: 0.916992 -0.241619 -0.555220 -0.548797 -0.096262 -0.270273 -0.026893 0.069257 -0.524010 -0.338041 -0.344662 0.369531 -0.327023 -0.320460 -0.062458 -0.106748 0.327078 -0.143791 -0.385581 -0.364117 -0.116892 -0.285732 -0.266151 -0.192817 -0.332866 -0.743151 0.258691 0.216778 0.236758 0.186138 0.200457 0.214396 0.221644 0.202130 0.198430 0.221712 0.255758 0.312025 0.292661 0.289073 0.286190 0.240053 0.254887 0.266492 0.263621 0.292811
chargesum: 0.00000
title: Mulliken charges with hydrogens summed into heavy atoms:
elementType: S O O O N N N N C C C C C C C C C C C C C C C C C C
charge: 0.916992 -0.241619 -0.555220 -0.548797 -0.096262 -0.270273 -0.026893 0.069257 -0.048541 0.084855 0.070191 0.369531 0.096750 0.099682 -0.062458 -0.106748 0.327078 0.111966 -0.073556 -0.071455 -0.116892 0.003341 0.020039 0.047236 -0.077978 0.079774
polarizability: 4.18106177e+02 -4.01081091e+01 2.69749579e+02 -1.26169897e-01 2.02127073e+01 1.60611040e+02
1716.lowfreq: -5.8304 -0.0007 -0.0003 0.0009 4.0447 7.2242 21.7536 32.5899 32.7404
frequency: 21.7159 32.1821 32.5523 42.8352 58.7376 60.9781 85.8030 91.3445 127.0483 130.1999 155.2625 161.2571 167.7561 174.4664 223.3715 233.9825 246.4810 257.1443 282.8841 294.5826 314.7925 323.5013 333.8366 336.1344 377.7147 388.3346 398.3823 418.3568 430.3318 438.2141 466.7611 472.8334 519.6585 571.2708 573.5989 586.2187 596.5595 605.0550 614.9170 625.9041 683.9754 689.9677 741.4883 747.7562 756.2252 767.2911 779.0045 786.1334 799.1224 810.8945 845.8497 861.0715 867.9554 882.1475 886.8408 901.9471 911.1102 943.8086 963.0424 969.1184 992.5899 993.6264 995.8564 1004.5677 1020.7801 1025.0469 1025.8339 1030.8414 1053.8282 1054.5144 1084.4186 1097.9633 1106.1380 1114.5535 1120.5524 1129.3607 1149.3692 1177.5486 1191.2450 1192.4904 1207.2108 1238.7731 1262.5083 1279.0083 1289.9468 1298.5321 1302.5924 1328.1213 1339.6647 1343.6050 1356.0877 1361.5867 1371.4709 1372.6292 1384.9092 1396.1068 1407.7145 1411.8394 1420.2936 1425.3182 1445.9296 1448.7369 1454.3243 1459.1183 1464.1508 1471.9640 1477.5688 1493.0295 1528.2444 1582.6211 1598.0798 1600.6007 2842.5328 2857.1443 2875.4047 2958.6880 2964.2825 3007.5386 3020.4187 3028.8538 3038.1596 3086.3646 3089.8191 3093.3496 3148.8839 3149.6901 3149.8520 3166.6130 3171.9465 3178.6765 3182.8335 3196.0589
redmass: 5.5215 4.9922 5.0060 4.3784 5.1820 5.0775 4.5407 4.6641 4.2503 4.1829 1.5796 3.7464 2.8458 6.5442 3.7857 3.7059 4.6660 2.4708 4.0604 5.0444 4.7481 5.3660 4.3159 3.3372 5.5915 4.7556 1.9385 3.0766 7.8212 4.7790 4.0686 3.5474 3.7807 3.7524 6.0669 6.3989 3.5653 4.1564 4.2751 6.3286 7.0870 5.4719 4.5450 4.3815 4.9085 1.8425 2.9560 11.2457 5.1210 3.8262 1.5766 4.6889 1.4573 1.9145 1.8448 1.3521 2.4738 1.3604 1.8279 1.8441 1.9530 1.7861 4.0537 1.8800 2.5566 1.5053 2.2662 2.9596 1.9779 2.2531 3.7533 2.3287 2.1456 2.2089 1.9541 2.6357 2.6811 2.6319 1.0857 1.1953 1.8496 1.4061 1.3174 1.3791 1.2679 1.1414 1.3056 1.2922 1.4211 1.7032 1.5992 1.8449 1.8632 1.4575 2.8339 2.2974 1.0528 2.9675 1.0581 4.2972 1.0805 1.0827 1.1026 1.2825 2.0976 1.7130 1.8574 5.1400 7.4782 7.5469 6.4662 5.6689 1.0711 1.0695 1.0685 1.0669 1.0667 1.0864 1.0903 1.0246 1.0893 1.0963 1.0980 1.0948 1.0913 1.0914 1.0910 1.0906 1.0963 1.1070 1.1078 1.0999
irintensity: 4.1772 0.2826 0.3667 1.8585 1.6796 0.9084 4.9487 6.5738 5.3433 1.3205 0.9989 2.1465 0.9753 1.4706 1.0420 0.8190 1.9524 2.4659 5.1458 7.5149 10.9364 7.8990 15.3789 21.6484 7.1095 1.7712 1.7029 0.3836 50.0546 1.0858 4.4421 2.1457 7.0988 5.0176 13.6941 62.7224 9.9012 8.4003 4.9079 1.6448 13.8179 7.4388 1.5474 4.0511 26.9347 29.1525 27.3633 73.2621 5.4025 19.3960 0.1636 5.4980 19.6925 37.4981 19.8238 2.2054 19.7022 0.2207 40.3311 49.0040 29.5732 18.7600 2.2935 57.2145 2.3447 3.8345 13.7570 3.1071 29.9847 53.0995 46.3386 11.1680 28.9004 22.5286 5.3967 63.0899 6.4574 19.5231 3.2949 1.4312 6.8185 22.0753 13.7750 6.4189 2.3607 4.2199 5.8309 12.3235 13.4613 57.9903 3.8392 5.7596 1.2070 3.9402 3.9109 7.4153 9.6777 31.8184 17.0067 0.8395 3.4408 0.6213 17.8390 18.3658 16.0579 38.8367 11.9772 25.8308 2.9548 0.8488 40.1173 2.2058 46.1286 66.4035 136.4395 35.7065 65.7134 10.2317 40.0798 1.4111 25.5018 35.2064 43.0395 26.1097 0.8643 2.7757 11.5052 4.0730 0.1426 1.1177 1.5390 8.1888
temp: 298.150 k
press: 1.00000 atm
elementType: 16 8 8 8 7 7 7 7 6 6 6 6 6 6 6 6 6 6 6 6 6 6 6 6 6 6 1 1 1 1 1 1 1 1 1 1 1 1 1 1 1 1 1 1 1 1
symmnumber: 1
zpe: 935828.1 jmol-1
zpe.correction: 0.356438 hartree
zpe.thermalcorrener: 0.380098 hartree
zpe.thermalcorrenthalpy: 0.381042 hartree
zpe.thermalcorrgfe: 0.301577 hartree
zpe.sumelectzpe: -1538.554969 hartree
zpe.sumelectthermal: -1538.531310 hartree
zpe.sumelectthermalent: -1538.530366 hartree
zpe.sumelectthermalfe: -1538.609830 hartree
dipole: 7.8251 1.6523 7.2572
dipole: 10.7995
quadrupole: -162.1552 -182.1940 -159.2988
quadrupole: -0.9569 -19.7750 0.3664
quadrupole: 5.7275 -14.3114 8.5839 -0.9569 -19.7750 0.3664
hfenergy: -1538.9114073 hartree
pointgroup: C01 [X(C18H20N4O3S1)]
dipole: 2.7113269 2.0496077 2.5496147 debye
polarizability: 427.7211233|9.1678074|263.8292363|-5.7319599|0.2957083|156.9164354 unknown
InChI: InChI=1S/C18H20N4O3S/c1-26(23,24)15-5-3-14(4-6-15)17-16(13-21-9-11-25-12-10-21)22-8-2-7-19-18(22)20-17/h2-8H,9-13H2,1H3
charge 0 multiplicity 1
46 atoms
S  -5.350978 -1.605064 0.118279
O  0.737089 4.911181 -1.648719
O  -5.972996 -0.245039 -0.550281
O  -5.663114 -3.098692 -0.474032
N  0.70395 2.506673 -0.027743
N  2.874658 -0.206335 0.474334
N  1.57083 -2.042575 -0.004929
N  3.997879 -2.335452 -0.063102
C  1.163973 1.592816 1.055996
C  1.720953 2.7029 -1.094612
C  0.256706 3.815762 0.52329
C  1.546274 0.219501 0.580035
C  1.153534 3.610179 -2.197676
C  -0.283741 4.703294 -0.610388
C  0.769447 -0.931099 0.269111
C  2.848785 -1.62625 0.111438
C  -0.698374 -1.059818 0.228738
C  4.088066 0.439505 0.639914
C  -1.549735 0.073221 0.08581
C  -1.26765 -2.36317 0.304805
C  -3.46809 -1.388605 0.189794
C  -2.951606 -0.089094 0.069675
C  -2.665161 -2.538645 0.281293
C  5.254577 -0.295011 0.459837
C  5.166586 -1.684559 0.107771
C  -5.903448 -1.618859 1.954483
H  0.328321 1.496869 1.775797
H  2.019022 2.041615 1.624471
H  1.984563 1.71992 -1.52637
H  2.652619 3.171035 -0.684575
H  1.095762 4.348766 1.036991
H  -0.542039 3.637513 1.269169
H  1.9207 3.83972 -2.954712
H  0.287797 3.110981 -2.68297
H  -1.185467 4.232268 -1.05759
H  -0.538994 5.708727 -0.237992
H  4.075167 1.49945 0.904052
H  -1.107596 1.065205 -0.073924
H  -0.592476 -3.221756 0.366352
H  -3.629841 0.758459 -0.077745
H  -3.12067 -3.534386 0.300737
H  6.226229 0.187746 0.582529
H  6.076099 -2.276116 -0.037856
H  -5.401677 -2.470156 2.434314
H  -5.613336 -0.650982 2.38538
H  -6.9943 -1.747143 1.916717
