program: Gaussian 09
title: 000199112
version: EM64L-G09RevD.01
frameworkgroup: C1[X(C10H15NO)]
method: RPBEPBE
basis: SDD
operation: Freq
keyword: #p
keyword: freq=noraman
keyword: PBEPBE/SDD
title: #p freq=noraman PBEPBE/SDD
converged: YES YES NO NO
title: Mulliken charges:
elementType: O N C C C C C C C C C C H H H H H H H H H H H H H H H
charge: -0.278777 -0.232124 -0.108244 -0.578652 0.499575 -0.701214 -0.421416 -0.392794 -0.228037 -0.231425 -0.243125 -0.475332 0.238486 0.199792 0.233865 0.253552 0.190417 0.232852 0.258719 0.231340 0.232398 0.224142 0.223759 0.227681 0.211337 0.215565 0.217660
chargesum: 0.00000
title: Mulliken charges with hydrogens summed into heavy atoms:
elementType: O N C C C C C C C C C C
charge: -0.278777 0.026595 0.130242 -0.144995 0.499575 -0.024393 -0.190076 -0.160397 -0.003895 -0.007666 -0.015444 0.169231
polarizability: 1.57902192e+02 4.78236950e+00 1.14067050e+02 -1.14757429e+01 6.99548380e+00 7.98176555e+01
1716.lowfreq: -12.0887 -7.9600 -0.0007 -0.0005 -0.0003 6.0563 27.6006 35.1404 63.3090
frequency: 27.4385 34.8697 63.2019 75.4215 92.4607 164.6094 218.6934 234.4048 243.9408 276.3966 339.1802 380.7503 403.5201 428.8555 471.2495 524.1091 584.8172 617.6216 704.9043 752.0782 753.2290 821.6829 839.0893 852.8158 891.4267 908.9877 919.3290 937.0505 974.9491 990.2063 993.6154 1003.6488 1026.6513 1048.7717 1094.2143 1107.5577 1117.4902 1141.9764 1163.1521 1171.6470 1186.7722 1209.4006 1215.1667 1273.8194 1313.2219 1329.1051 1334.5554 1381.7677 1382.6156 1401.1226 1415.8995 1439.8278 1440.2933 1469.3514 1473.6147 1477.3971 1481.1076 1484.5158 1592.9196 1614.0868 2959.7152 2972.2323 2979.4027 3014.1606 3043.1120 3052.9805 3070.7722 3092.1814 3099.1163 3113.8566 3117.0057 3131.8594 3143.2801 3162.0581 3296.2515
redmass: 3.0780 3.4915 2.9627 3.6703 3.0356 1.3393 2.3469 1.1627 3.7416 3.7257 2.5448 2.4558 2.8141 3.0761 2.2989 3.2542 4.1660 6.3286 1.7861 5.2520 1.9006 3.2352 2.9591 1.2640 1.6304 2.1442 1.5355 1.7421 1.3888 6.2629 1.3104 2.4672 2.1885 1.6152 1.7518 1.3601 1.9691 1.5154 1.7855 1.0550 1.1159 1.4249 2.4642 1.2733 1.4182 1.3245 1.3183 5.7291 1.2584 1.1610 1.1294 1.3097 1.5468 1.0540 1.0907 1.0566 1.2726 1.6930 6.0487 6.1705 1.0289 1.0395 1.0601 1.0838 1.1006 1.1047 1.0962 1.1018 1.0997 1.0869 1.0868 1.0909 1.0959 1.1015 1.0746
irintensity: 0.6731 0.2536 5.0484 0.5358 0.1587 0.7279 1.2080 0.5281 1.3911 3.9816 1.0446 11.7017 0.0026 0.9027 18.0883 19.2469 3.6779 0.1433 50.3516 16.9565 42.1650 15.5809 3.5000 0.0497 20.2496 23.1446 9.5955 40.8199 0.1086 0.0719 0.1133 19.1608 6.0240 8.2649 12.7058 1.8008 7.9599 2.1605 22.8100 0.1383 0.3944 4.0323 0.0619 9.8148 5.7978 3.1830 5.1438 1.9965 26.7427 8.7991 4.1069 3.2618 10.7420 4.1836 0.0784 17.5677 26.6465 12.1404 1.3341 10.8132 76.5491 18.1088 25.9393 8.0816 20.1180 60.8461 43.0026 31.0930 19.9683 8.9183 6.4953 11.3925 45.7831 23.3719 5.3637
temp: 298.150 k
press: 1.00000 atm
elementType: 8 7 6 6 6 6 6 6 6 6 6 6 1 1 1 1 1 1 1 1 1 1 1 1 1 1 1
symmnumber: 1
zpe: 601485.7 jmol-1
zpe.correction: 0.229094 hartree
zpe.thermalcorrener: 0.241907 hartree
zpe.thermalcorrenthalpy: 0.242852 hartree
zpe.thermalcorrgfe: 0.188182 hartree
zpe.sumelectzpe: -519.050122 hartree
zpe.sumelectthermal: -519.037308 hartree
zpe.sumelectthermalent: -519.036364 hartree
zpe.sumelectthermalfe: -519.091034 hartree
dipole: -0.2216 0.1597 -0.2263
dipole: 0.3547
quadrupole: -68.6916 -65.9573 -76.6169
quadrupole: 3.2260 -3.7315 3.6674
quadrupole: 1.7304 4.4646 -6.1950 3.2260 -3.7315 3.6674
hfenergy: -519.2792153 hartree
pointgroup: C01 [X(C10H15N1O1)]
dipole: 0.0784655 -0.0654351 -0.0950692 debye
polarizability: 159.3268157|4.568371|113.5960485|3.4570827|-8.6016929|78.8640333 unknown
InChI: InChI=1S/C10H15NO/c1-9(11-12-2)8-10-6-4-3-5-7-10/h3-7,9,11H,8H2,1-2H3
charge 0 multiplicity 1
27 atoms
O  -3.805537 0.233979 0.787982
N  -2.844576 0.320366 -0.375167
C  -1.450711 0.33569 0.186687
C  -0.49007 0.350574 -1.040056
C  0.965239 0.127436 -0.655753
C  -1.189621 1.489717 1.177051
C  1.903182 1.19082 -0.661774
C  1.411173 -1.162612 -0.263569
C  3.249147 0.975568 -0.284753
C  2.753556 -1.382846 0.115755
C  3.679044 -0.3126 0.107504
C  -4.617989 -0.97588 0.609687
H  -1.330515 -0.632123 0.709013
H  -0.59883 1.318732 -1.56887
H  -0.832549 -0.441464 -1.732938
H  -1.947356 1.473193 1.978607
H  -1.244885 2.469127 0.661345
H  -0.187474 1.401333 1.632506
H  -3.057324 1.263944 -0.761151
H  1.577374 2.193016 -0.966754
H  0.701923 -2.000295 -0.264487
H  3.959857 1.809851 -0.298922
H  3.079818 -2.386406 0.412149
H  4.721643 -0.482119 0.399006
H  -3.987435 -1.884541 0.572499
H  -5.228914 -0.919574 -0.31111
H  -5.272667 -1.005986 1.498414
