program: Gaussian 09
title: 000199108
version: EM64L-G09RevD.01
frameworkgroup: C1[X(C11H17NO)]
method: RPBEPBE
basis: SDD
operation: Freq
keyword: #p
keyword: freq=noraman
keyword: PBEPBE/SDD
title: #p freq=noraman PBEPBE/SDD
converged: YES YES NO NO
title: Mulliken charges:
elementType: O N C C C C C C C C C C C H H H H H H H H H H H H H H H H H
charge: -0.278967 -0.232146 -0.107442 -0.583800 0.503241 -0.702438 -0.418549 -0.392527 0.432544 -0.391656 -0.390107 -0.806962 -0.475325 0.238376 0.199474 0.232741 0.252753 0.190014 0.232985 0.258437 0.229437 0.230701 0.226821 0.226348 0.223849 0.223947 0.234486 0.211053 0.215499 0.217214
chargesum: 0.00000
title: Mulliken charges with hydrogens summed into heavy atoms:
elementType: O N C C C C C C C C C C C
charge: -0.278967 0.026291 0.130934 -0.151585 0.503241 -0.026686 -0.189112 -0.161826 0.432544 -0.164835 -0.163758 -0.124680 0.168441
polarizability: 1.80891910e+02 2.97921207e+00 1.23709767e+02 -1.21221805e+01 4.08069033e+00 8.88424750e+01
1716.lowfreq: -19.8384 -9.1562 -6.7576 -0.0012 -0.0010 -0.0008 1.3431 25.7331 31.7748
frequency: -19.5029 25.0983 31.6038 53.5482 64.0950 89.8439 147.4008 179.0423 223.7157 231.6300 262.5949 299.8572 312.9474 368.5261 385.6199 407.4017 442.9455 471.9627 498.6048 555.2266 639.2124 718.1387 731.9983 772.7161 807.0725 838.7583 847.1035 850.6610 891.8308 909.4373 933.7595 952.6679 972.4533 983.7448 1003.7482 1013.9922 1046.8851 1063.1832 1105.2690 1112.8571 1128.9975 1141.7477 1162.4199 1191.8846 1210.4135 1216.6402 1223.4744 1276.2374 1308.6112 1325.2256 1330.9418 1374.9505 1382.0567 1397.0677 1402.3100 1407.6741 1416.2565 1440.4312 1467.6973 1471.5259 1472.8038 1473.3074 1477.2413 1482.6372 1509.5197 1584.2629 1625.7962 2958.4124 2972.2780 2973.4379 2978.5779 3015.6916 3042.5550 3051.3393 3054.3869 3071.0881 3082.8746 3091.5236 3099.2607 3107.6238 3110.2728 3130.2656 3137.2593 3296.9546
redmass: 1.0178 3.0677 3.4966 3.4079 3.1219 3.0374 2.4705 1.5380 1.2973 2.2311 2.8698 2.6075 3.9275 2.9320 2.2692 2.8289 2.5888 2.8514 3.2371 2.8964 6.7129 3.5426 3.9274 3.3789 2.1612 3.4482 2.1825 1.2855 1.6431 2.2568 1.6999 1.3507 1.3808 1.4124 2.5421 2.9184 1.5565 1.5675 1.8015 1.5715 1.3703 1.5178 1.8012 1.1028 1.4634 3.3282 2.3165 1.2766 1.3322 1.3489 1.4022 4.4684 1.2262 1.2250 1.2148 2.4426 1.1304 1.0576 1.0551 1.0849 1.0549 1.0862 1.0524 1.0666 2.7327 5.9974 6.4609 1.0290 1.0394 1.0386 1.0601 1.0840 1.1003 1.1047 1.0950 1.0961 1.0997 1.1017 1.0997 1.0868 1.0871 1.0962 1.0973 1.0746
irintensity: 0.5401 0.3062 0.2945 1.6081 4.4587 0.1006 0.4141 1.9275 1.0408 0.2653 4.5047 0.6728 0.9006 5.5006 7.5871 0.0292 0.7156 14.1134 22.1758 12.7033 0.0421 2.2579 10.1861 17.5270 22.0818 6.9352 24.0492 0.5198 19.2372 27.2641 42.9285 2.3411 0.0384 1.2361 19.8545 3.4292 16.0878 7.6946 5.5438 5.0604 14.8939 2.5789 22.7438 0.2175 4.3904 0.2105 0.4385 9.2852 2.4411 3.4236 6.3758 1.2518 27.3527 9.2711 8.7775 1.2395 4.3141 6.8049 4.8038 7.4821 12.3358 6.7621 16.0358 20.6333 38.9304 0.2396 0.4516 77.5801 18.3310 41.5617 26.6570 7.1301 20.8220 62.0434 25.0254 43.0039 19.1309 31.4842 21.5885 7.5586 23.1590 49.5309 1.5376 5.5416
temp: 298.150 k
press: 1.00000 atm
elementType: 8 7 6 6 6 6 6 6 6 6 6 6 6 1 1 1 1 1 1 1 1 1 1 1 1 1 1 1 1 1
symmnumber: 1
zpe: 671841.3 jmol-1
zpe.correction: 0.255891 hartree
zpe.thermalcorrener: 0.269772 hartree
zpe.thermalcorrenthalpy: 0.270716 hartree
zpe.thermalcorrgfe: 0.213402 hartree
zpe.sumelectzpe: -558.279340 hartree
zpe.sumelectthermal: -558.265459 hartree
zpe.sumelectthermalent: -558.264515 hartree
zpe.sumelectthermalfe: -558.321829 hartree
dipole: -0.6925 0.2133 -0.0595
dipole: 0.7271
quadrupole: -73.1843 -71.9960 -83.5477
quadrupole: 2.3920 -4.3224 2.7047
quadrupole: 3.0583 4.2467 -7.3050 2.3920 -4.3224 2.7047
hfenergy: -558.5352307 hartree
pointgroup: C01 [X(C11H17N1O1)]
dipole: -0.2705086 0.0863097 -0.0346298 debye
polarizability: 182.133106|3.5370853|122.5091701|-4.9863485|7.8242375|88.8018758 unknown
InChI: InChI=1S/C11H17NO/c1-9-4-6-11(7-5-9)8-10(2)12-13-3/h4-7,10,12H,8H2,1-3H3
charge 0 multiplicity 1
30 atoms
O  4.192994 -0.157732 0.857014
N  3.266186 -0.283867 -0.329693
C  1.858456 -0.335604 0.194278
C  0.931871 -0.385507 -1.057106
C  -0.539144 -0.201495 -0.714588
C  1.603925 -1.491011 1.185003
C  -1.445487 -1.29074 -0.714809
C  -1.042657 1.079374 -0.368458
C  -3.307468 0.169706 -0.02281
C  -2.805667 -1.108213 -0.377195
C  -2.400546 1.261606 -0.029911
C  -4.762433 0.361421 0.371331
C  4.964481 1.08053 0.692818
H  1.696981 0.631424 0.706966
H  1.081476 -1.354208 -1.575278
H  1.270858 0.410425 -1.747209
H  2.33759 -1.447336 2.007697
H  1.703141 -2.470983 0.67675
H  0.586703 -1.430031 1.610531
H  3.517451 -1.224046 -0.700452
H  -1.08497 -2.290239 -0.988493
H  -0.366088 1.943687 -0.377355
H  -3.486997 -1.968173 -0.392025
H  -2.765347 2.264284 0.226332
H  -5.124088 1.371351 0.10819
H  -5.417704 -0.375907 -0.125308
H  -4.898916 0.238832 1.463673
H  4.302002 1.965352 0.636522
H  5.598832 1.043542 -0.213067
H  5.595967 1.138256 1.596852
