program: Gaussian 09
title: 000199103
version: EM64L-G09RevD.01
frameworkgroup: C1[X(C9H6N2O2S)]
method: RPBEPBE
basis: SDD
operation: Freq
keyword: #p
keyword: freq=noraman
keyword: PBEPBE/SDD
title: #p freq=noraman PBEPBE/SDD
converged: YES YES NO NO
title: Mulliken charges:
elementType: S O O N N C C C C C C C C C H H H H H H
charge: 0.300118 -0.212115 -0.209324 -0.017447 0.024883 0.394890 0.286717 -0.334232 -0.343831 0.383531 -0.372487 -0.366695 -0.697714 -0.479775 0.227411 0.288144 0.286485 0.287441 0.275462 0.278538
chargesum: 0.00000
title: Mulliken charges with hydrogens summed into heavy atoms:
elementType: S O O N N C C C C C C C C C
charge: 0.300118 -0.212115 -0.209324 -0.017447 0.024883 0.394890 0.286717 -0.106822 -0.055686 0.383531 -0.086003 -0.079255 -0.422251 -0.201236
polarizability: 2.66815933e+02 -4.42300923e+00 1.35824707e+02 -1.15152591e-02 5.22942792e-03 4.96119366e+01
1716.lowfreq: -5.1163 -4.2291 0.0021 0.0023 0.0026 8.9462 35.7447 55.3861 69.3630
frequency: 35.6723 55.3822 69.3412 109.0398 161.2875 235.3850 245.8426 303.3896 410.1506 416.0229 453.9434 463.2376 500.7235 513.4192 573.2430 626.0327 662.8151 667.0716 680.9701 728.4852 737.5534 755.8429 789.1676 812.1109 835.0495 845.0670 866.8168 884.9693 988.9681 1001.2569 1012.3409 1027.6425 1095.7585 1110.5359 1174.5648 1185.2029 1222.1166 1239.0281 1276.8243 1306.3308 1361.2406 1397.9697 1421.5076 1452.8613 1462.3115 1522.6398 1589.3799 1611.9604 3150.3510 3169.6724 3184.1091 3188.5538 3229.4026 3246.2791
redmass: 6.3623 8.5485 6.2458 8.8478 7.8587 8.4747 11.3147 6.3470 2.8971 6.8496 3.9902 8.8471 3.7151 6.5144 10.5950 7.1586 5.7457 9.1423 3.7994 7.1291 1.6891 2.0759 9.1046 1.4507 5.2798 1.3539 7.0650 1.5778 1.3590 3.5743 1.3525 2.4118 3.1551 1.3330 1.2781 1.4109 4.3692 1.4713 2.9538 1.4894 8.0523 9.5597 3.9264 3.3602 7.0399 4.9499 8.0217 6.1973 1.0897 1.0891 1.0951 1.0969 1.0964 1.0958
irintensity: 0.2302 0.9635 0.1174 0.7430 4.9930 2.2762 0.7518 0.0023 0.0052 1.3805 6.8238 8.7544 0.7905 0.5234 9.9701 0.6555 11.1986 2.3926 8.4687 12.8008 8.8021 5.7246 39.5627 100.5073 45.9121 15.4668 8.2115 41.3905 1.7536 1.9915 0.0024 3.8106 24.1293 15.3431 9.0613 127.7134 426.5024 1.7623 4.0103 0.5314 91.9797 15.3927 38.3142 2.4312 36.4051 10.9008 2.3692 127.9732 8.6118 0.4923 1.2879 1.1317 0.4491 3.5134
temp: 298.150 k
press: 1.00000 atm
elementType: 16 8 8 7 7 6 6 6 6 6 6 6 6 6 1 1 1 1 1 1
symmnumber: 1
zpe: 353298.2 jmol-1
zpe.correction: 0.134564 hartree
zpe.thermalcorrener: 0.145910 hartree
zpe.thermalcorrenthalpy: 0.146854 hartree
zpe.thermalcorrgfe: 0.095355 hartree
zpe.sumelectzpe: -1003.501650 hartree
zpe.sumelectthermal: -1003.490304 hartree
zpe.sumelectthermalent: -1003.489360 hartree
zpe.sumelectthermalfe: -1003.540859 hartree
dipole: 6.6003 -1.0492 -0.0025
dipole: 6.6832
quadrupole: -106.1144 -80.7708 -89.8292
quadrupole: 0.6104 0.0030 -0.0023
quadrupole: -13.8763 11.4674 2.4089 0.6104 0.0030 -0.0023
hfenergy: -1003.6362138 hartree
pointgroup: C01 [X(C9H6N2O2S1)]
dipole: -2.5816797 0.4984785 0.0045886 debye
dipolederiv: -0.5061017 0.1977846 0.0013302 -0.0432105 -0.2543703 -0.0005654 0.0014824 -0.0011894 0.1657533 -0.8889323 -0.1885879 -0.0000033 -0.3660943 -0.6496549 -0.0014543 -0.0007115 -0.0015332 -0.234332 -0.8523498 0.2153872 0.0017779 0.3751794 -0.6884135 -0.0024995 0.0025656 -0.0024329 -0.2321327 -0.6068903 0.3477357 0.0014085 0.154821 -0.3497982 -0.0004932 0.0017148 -0.0006302 -0.1585374 2.2931937 -0.0578757 -0.0030297 -0.0393782 1.0906073 0.0040984 -0.0028729 0.0041082 0.1921377 0.8689828 -0.0358016 -0.0012356 -0.0366976 0.1005946 0.0003403 -0.001346 0.0002944 0.0713991 -0.0398648 -0.0018268 -0.0000092 0.2866474 0.0078975 -0.0008341 0.0002538 0.0000185 0.0462013 -0.4519908 -0.1350519 -0.0002299 -0.2955379 0.0342389 0.0013008 -0.0005404 0.0009178 -0.1449536 -0.4959404 0.1933274 0.0013665 0.331513 -0.026654 0.0001271 0.0018903 0.0000914 -0.1341566 -1.0974287 0.0534536 0.0018269 -0.0148983 0.050903 -0.0000083 0.0014193 -0.000036 0.046462 0.2961833 0.1007125 -0.0000951 -0.1934008 -0.0288819 0.0006228 -0.0014242 0.0002319 -0.0992679 0.3846057 -0.1578798 -0.0013951 0.1984774 -0.0122574 0.0001619 -0.0001207 0.0007154 -0.1015968 0.4990892 -0.0745467 -0.0014038 -0.0647319 -0.0865269 0.0004275 -0.0017776 0.0005097 -0.2922419 0.1239698 -0.4344188 -0.0011223 -0.207616 0.6092023 0.0017124 -0.0013553 0.0017655 -0.1754251 0.0380099 0.0977608 0.0005937 0.0831569 -0.0306868 -0.0009389 0.000652 -0.0008728 0.1428849 0.1161584 -0.0607117 -0.0002883 -0.0638171 0.0381541 -0.0004986 -0.0002915 -0.00043 0.1531503 0.0901298 -0.0574761 -0.0001587 -0.0225264 0.0584531 -0.0005031 -0.0000766 -0.00046 0.1715974 0.0920076 0.0574049 0.0003893 0.0213588 0.0571468 -0.0005594 0.0002886 -0.0006234 0.1700622 0.0817485 -0.0637713 0.0000647 -0.0705095 0.0506109 -0.0001894 -0.0000065 -0.0002771 0.2154346 0.0554201 0.0043816 0.0002134 -0.0327354 0.0294355 -0.000247 0.0002562 -0.0001677 0.1975611 unknown
polarizability: 266.3795961|-8.7436922|136.2594586|-0.3385147|0.3157366|49.6135218 unknown
InChI: InChI=1S/C9H6N2O2S/c12-11(13)8-3-1-7(2-4-8)9-5-14-6-10-9/h1-6H
charge 0 multiplicity 1
20 atoms
S  -4.686743 0.756904 -0.0019
O  4.280197 1.074776 -0.011848
O  4.217217 -1.206307 -0.022008
N  -2.824597 -1.146809 -0.007721
N  3.64163 -0.049403 -0.015846
C  -0.652999 0.077057 -0.009545
C  -2.12905 0.087162 -0.006882
C  0.107478 1.281039 -0.005221
C  0.033202 -1.170532 -0.01615
C  2.162296 -0.008138 -0.013919
C  1.511197 1.246508 -0.007422
C  1.437468 -1.220583 -0.018474
C  -2.960897 1.206444 -0.003742
C  -4.128106 -0.988585 -0.006138
H  -0.395648 2.253181 -0.000055
H  -0.559416 -2.089228 -0.019384
H  2.110186 2.160789 -0.003955
H  1.978955 -2.170047 -0.02366
H  -2.687742 2.258965 -0.002158
H  -4.863227 -1.792293 -0.006273
