program: Gaussian 09
title: 000199104
version: EM64L-G09RevD.01
frameworkgroup: C1[X(C19H21NO3)]
method: RPBEPBE
basis: SDD
operation: Freq
keyword: #p
keyword: freq=noraman
keyword: PBEPBE/SDD
title: #p freq=noraman PBEPBE/SDD
converged: YES YES NO NO
title: Mulliken charges:
elementType: O O O N C C C C C C C C C C C C C C C C C C C H H H H H H H H H H H H H H H H H H H H H
charge: -0.224838 -0.240847 -0.236636 -0.124391 -0.385389 -0.339658 0.190171 -0.407890 -0.639104 -0.659196 0.331518 0.294348 -0.387468 -0.340972 -0.337859 -0.372361 0.009614 0.291838 -0.376881 -0.361666 -0.237156 -0.232968 -0.231037 0.229150 0.229330 0.261744 0.204217 0.230353 0.234815 0.223948 0.222204 0.221945 0.202902 0.253737 0.219791 0.264869 0.245820 0.269952 0.271369 0.267873 0.270280 0.231122 0.231450 0.231957
chargesum: 0.00000
title: Mulliken charges with hydrogens summed into heavy atoms:
elementType: O O O N C C C C C C C C C C C C C C C C C C C
charge: -0.224838 -0.240847 -0.236636 -0.124391 0.073091 0.126304 0.190171 0.057278 0.028993 0.017235 0.331518 0.294348 -0.122599 -0.095152 -0.067907 -0.100992 0.009614 0.291838 -0.109008 -0.091387 -0.006035 -0.001518 0.000920
polarizability: 3.70020454e+02 8.65916735e+00 2.15285278e+02 1.03542805e+01 6.73022951e+00 1.29519649e+02
1716.lowfreq: -5.6321 -3.3609 -0.0004 -0.0002 0.0008 3.5988 14.5095 21.6949 33.6753
frequency: 14.3903 20.6849 33.6199 41.9572 48.8063 63.4307 76.3552 81.4277 101.5775 118.9568 133.6851 166.4887 170.8729 184.5143 197.4662 213.3511 227.9540 267.9343 289.5937 308.9811 318.7119 352.1723 376.4681 404.1888 414.7101 419.6505 439.0790 472.3961 500.8740 505.5767 556.3977 578.0713 594.1456 612.6611 613.9382 629.8225 677.1936 689.2259 705.2154 745.4053 751.5735 776.3506 786.5790 797.7535 825.3031 829.4006 849.8425 864.5711 898.8741 914.8501 941.9529 945.0617 967.1621 978.5752 989.0316 991.3396 996.6611 1001.3545 1004.0340 1007.2757 1027.2851 1031.2782 1070.5866 1081.0840 1083.4185 1096.8723 1119.2525 1137.6771 1151.7354 1173.8794 1178.7025 1190.2448 1211.6166 1220.3187 1233.5031 1254.7878 1285.3581 1298.8239 1306.3024 1318.4181 1338.3191 1347.2849 1358.3908 1371.1406 1382.6122 1384.7567 1396.0271 1413.1176 1426.6930 1432.7345 1453.1866 1461.4944 1468.8145 1470.8255 1476.6574 1479.6662 1482.7955 1494.5644 1500.1003 1527.4109 1570.8127 1587.1861 1607.4414 1613.9183 1617.6138 2942.2110 2984.4687 2986.9977 2999.5138 3005.5116 3007.1770 3052.1201 3068.1486 3085.2399 3085.8928 3092.1729 3102.6141 3127.4945 3137.4277 3144.8471 3147.8696 3151.0415 3158.6795 3164.3787 3168.9413 3174.2419
redmass: 4.4918 4.4699 3.8437 4.4759 3.7164 3.9632 5.2713 4.9184 3.2996 5.8520 3.4298 4.0311 3.2941 2.9945 2.6256 1.3583 1.4421 2.6270 5.6022 4.7517 3.2170 3.5851 5.6085 2.8383 2.9943 3.0233 3.9516 3.8327 3.3995 3.8293 4.4142 3.8528 3.8357 4.9351 6.4607 6.8143 4.1189 5.3836 1.6399 2.9099 3.2214 1.2345 1.2967 2.2257 1.4325 3.7492 1.6772 1.2900 2.5722 5.1544 2.1701 1.5049 1.4024 1.3655 4.4193 1.4872 1.8629 3.2935 1.3621 3.1100 2.1680 3.3532 2.0654 1.8236 1.5835 1.7573 1.3237 2.0796 2.9747 1.0578 1.2546 1.1530 2.6093 1.1259 2.7414 1.6370 2.7971 1.3402 1.4311 1.3729 1.3626 1.3331 1.2961 4.3209 8.6148 1.2157 1.2090 2.3618 4.2518 2.2724 1.1016 1.1485 1.0497 1.0432 2.1947 1.0632 1.0559 1.6531 1.4034 10.1524 7.0056 6.2909 6.0038 7.8423 6.5247 1.0556 1.0360 1.0358 1.0641 1.0958 1.0691 1.0999 1.0994 1.0991 1.0994 1.1014 1.1020 1.0850 1.0882 1.0874 1.0909 1.0904 1.0959 1.0960 1.1011 1.0967
irintensity: 1.0621 2.5446 1.2873 0.8312 1.2070 0.4443 3.2880 0.1043 1.5791 2.1060 2.2389 2.1056 6.8657 2.8823 0.8861 0.9402 0.7927 1.1965 3.9321 0.1599 2.4986 18.2623 1.5036 0.5270 6.0308 0.4446 3.3987 1.8877 10.5473 0.3182 1.6409 0.9804 10.3150 41.2500 2.3167 1.3012 20.7272 5.8290 74.3635 33.0089 9.9359 5.8185 16.8899 14.6211 14.8287 15.6363 49.3002 8.3544 31.2617 64.2091 7.2906 4.1524 5.6465 5.6627 3.7070 1.5933 0.7482 10.1889 4.1568 30.6509 3.3151 60.7270 17.0021 10.2747 12.9593 22.8112 16.6432 118.2004 22.2052 3.8109 213.3209 0.8552 41.1381 2.7027 387.2143 15.4138 360.1812 13.8365 75.9019 26.6100 11.2449 5.1844 7.8586 61.0117 1.7745 19.2689 24.3513 113.0694 2.7722 13.7718 40.2622 8.2776 9.8126 17.8256 4.9302 9.7075 12.4813 38.2460 8.6513 157.9060 47.7683 24.8830 65.0415 275.9891 187.2394 60.7629 26.5752 19.7137 42.7007 6.3296 48.5976 13.8147 9.5189 35.8143 43.9446 50.5499 31.5134 0.4215 6.5847 6.9947 26.7072 2.0663 18.9163 19.3747 24.1479 2.8375
temp: 298.150 k
press: 1.00000 atm
elementType: 8 8 8 7 6 6 6 6 6 6 6 6 6 6 6 6 6 6 6 6 6 6 6 1 1 1 1 1 1 1 1 1 1 1 1 1 1 1 1 1 1 1 1 1
symmnumber: 1
zpe: 935522.8 jmol-1
zpe.correction: 0.356322 hartree
zpe.thermalcorrener: 0.378734 hartree
zpe.thermalcorrenthalpy: 0.379678 hartree
zpe.thermalcorrgfe: 0.301371 hartree
zpe.sumelectzpe: -1015.360385 hartree
zpe.sumelectthermal: -1015.337973 hartree
zpe.sumelectthermalent: -1015.337029 hartree
zpe.sumelectthermalfe: -1015.415337 hartree
dipole: 3.9243 1.1405 1.4277
dipole: 4.3289
quadrupole: -97.3857 -142.5473 -137.8238
quadrupole: 32.7378 10.6229 -2.9003
quadrupole: 28.5332 -16.6283 -11.9049 32.7378 10.6229 -2.9003
hfenergy: -1015.7167073 hartree
pointgroup: C01 [X(C19H21N1O3)]
dipole: 1.5266155 0.2909094 -0.696704 debye
polarizability: 369.2135956|10.2221439|146.143176|-16.2529591|33.8501735|199.4686098 unknown
InChI: InChI=1S/C19H21NO3/c1-3-20(4-2)18(21)14-23-17-12-10-16(11-13-17)19(22)15-8-6-5-7-9-15/h5-13H,3-4,14H2,1-2H3
charge 0 multiplicity 1
44 atoms
O  1.929887 0.26012 0.701809
O  4.305785 0.847135 1.807357
O  -3.690373 -0.764925 -2.274256
N  5.510207 0.47809 -0.150513
C  5.596797 0.171254 -1.596497
C  6.785481 0.698762 0.577957
C  4.32553 0.579773 0.57168
C  3.030514 0.372058 -0.247558
C  5.822128 -1.329535 -1.891997
C  7.214971 2.180905 0.577086
C  0.637334 0.143356 0.182074
C  -2.076432 -0.080741 -0.630053
C  -0.388994 0.04286 1.156324
C  0.313739 0.11502 -1.201656
C  -1.728977 -0.061887 0.752645
C  -1.033049 -0.00651 -1.589439
C  -3.478802 -0.25782 -1.124224
C  -4.649349 0.16238 -0.275157
C  -4.591045 1.26186 0.623674
C  -5.882091 -0.522509 -0.450621
C  -5.741683 1.657753 1.340695
C  -7.024654 -0.138136 0.278637
C  -6.957246 0.953687 1.178429
H  4.687727 0.527901 -2.112275
H  6.433616 0.762507 -2.014747
H  6.640923 0.355932 1.616295
H  7.560556 0.065034 0.10777
H  2.871148 1.242903 -0.919301
H  3.090357 -0.545345 -0.867415
H  6.744283 -1.693357 -1.405054
H  4.981414 -1.941708 -1.51981
H  5.919686 -1.499209 -2.980005
H  7.339556 2.568247 -0.451198
H  6.45811 2.793761 1.095016
H  8.17823 2.301086 1.105865
H  -0.10485 0.045392 2.212557
H  1.0903 0.18057 -1.969405
H  -2.509285 -0.164575 1.513089
H  -1.304487 -0.052116 -2.649443
H  -3.660311 1.827811 0.735188
H  -5.919509 -1.347152 -1.170136
H  -5.691559 2.516227 2.019565
H  -7.96694 -0.680867 0.14546
H  -7.847044 1.25781 1.741185
