program: Gaussian 09
title: 000199088
version: EM64L-G09RevD.01
frameworkgroup: C1[X(C7H12Cl3O4P)]
method: RPBEPBE
basis: SDD
operation: Freq
keyword: #p
keyword: freq=noraman
keyword: PBEPBE/SDD
title: #p freq=noraman PBEPBE/SDD
converged: YES YES NO NO
title: Mulliken charges:
elementType: Cl Cl Cl P O O O O C C C C C C C H H H H H H H H H H H H
charge: -0.053981 0.031133 0.042959 1.400208 -0.511324 -0.497992 -0.494147 -0.597761 0.058400 -0.581557 -0.667899 -0.224569 -0.656044 0.149028 -0.370639 0.250965 0.261674 0.284530 0.216272 0.227605 0.271986 0.243124 0.244508 0.214476 0.236373 0.236430 0.286242
chargesum: 0.00000
title: Mulliken charges with hydrogens summed into heavy atoms:
elementType: Cl Cl Cl P O O O O C C C C C C C
charge: -0.053981 0.031133 0.042959 1.400208 -0.511324 -0.497992 -0.494147 -0.597761 0.309366 -0.035354 0.047964 0.263063 0.031235 0.435270 -0.370639
polarizability: 1.72753320e+02 -1.56122245e+01 1.45944079e+02 -3.60736313e+00 -1.65828960e+01 1.16355749e+02
1716.lowfreq: -9.3093 -0.0015 -0.0013 -0.0007 4.6907 7.9300 10.4938 13.8271 19.5499
frequency: 9.3632 13.0063 19.4939 22.6408 39.0530 70.6847 80.5353 102.4969 117.2398 128.4442 151.2558 168.6404 199.8836 213.0279 224.2510 239.5495 252.7212 281.5579 295.8129 310.2366 328.8295 344.5614 392.9672 420.7135 438.7432 445.8217 473.4036 591.7827 633.0427 680.7629 689.0533 707.0865 810.4397 829.2873 844.5997 869.0087 880.7583 885.5954 931.2435 1004.1977 1017.9790 1062.5402 1081.4820 1089.7120 1107.8193 1134.3408 1135.3292 1189.3758 1257.5741 1261.2466 1287.6657 1311.0224 1352.2959 1359.9563 1391.2837 1396.5479 1426.5335 1457.1402 1464.1537 1475.5164 1480.5127 1484.1455 1663.6121 2991.5445 2997.1867 3014.5762 3016.3666 3062.5459 3084.9096 3091.3467 3093.7052 3105.7202 3117.7118 3145.3286 3149.7676
redmass: 2.9592 10.3519 5.5943 10.7643 6.3417 7.4860 2.6973 4.9016 5.3196 4.7525 17.1259 3.8707 3.1356 3.6916 1.5121 1.3890 3.8749 4.5345 11.3316 5.0860 4.4450 5.6454 5.6564 4.9164 4.4552 6.2571 6.2079 6.6790 6.1446 6.6268 5.8813 6.4430 1.0967 1.3398 5.3426 5.6872 10.1267 1.4870 1.9917 2.2642 1.8610 13.0729 5.7653 2.3325 2.3419 1.4265 1.6042 1.4095 1.1486 1.2050 1.1522 1.3640 1.2457 1.2353 1.2022 1.2440 1.1047 1.0395 1.0561 1.0613 1.0460 1.0742 8.4759 1.0356 1.0360 1.0868 1.0576 1.0567 1.1078 1.0993 1.0975 1.1013 1.1041 1.0934 1.1105
irintensity: 0.1487 0.4372 2.1673 0.4675 2.1299 3.9115 2.5196 2.9760 6.3539 0.6845 1.2131 0.8905 1.6422 2.2099 1.3490 1.3458 3.9536 7.8278 2.2284 16.2230 18.1411 5.1613 39.1892 14.5205 12.8736 44.3555 29.4394 1.9983 29.5291 104.0218 51.0742 128.5703 3.3927 26.2556 258.4803 156.8142 272.8044 6.6322 54.0168 104.2002 113.1769 118.4536 391.3684 46.4727 25.4748 1.8484 21.5753 3.1236 1.0070 7.4541 17.2820 4.7724 15.5886 3.2531 26.1777 28.5325 13.3102 12.3110 10.0606 3.2216 12.9240 12.5554 24.7223 14.6328 14.9707 9.6702 15.6914 12.7353 0.9502 20.3271 21.0378 9.2261 29.6403 33.1056 7.7008
temp: 298.150 k
press: 1.00000 atm
elementType: 17 17 17 15 8 8 8 8 6 6 6 6 6 6 6 1 1 1 1 1 1 1 1 1 1 1 1
symmnumber: 1
zpe: 495853.8 jmol-1
zpe.correction: 0.188861 hartree
zpe.thermalcorrener: 0.208591 hartree
zpe.thermalcorrenthalpy: 0.209535 hartree
zpe.thermalcorrgfe: 0.134286 hartree
zpe.sumelectzpe: -2294.993348 hartree
zpe.sumelectthermal: -2294.973617 hartree
zpe.sumelectthermalent: -2294.972673 hartree
zpe.sumelectthermalfe: -2295.047922 hartree
dipole: -2.8683 -1.3181 -1.5009
dipole: 3.4953
quadrupole: -119.8061 -102.2146 -127.9608
quadrupole: 4.7067 2.1538 2.7717
quadrupole: -3.1456 14.4459 -11.3003 4.7067 2.1538 2.7717
hfenergy: -2295.1822086 hartree
pointgroup: C01 [X(C7H12Cl3O4P1)]
dipole: 1.1886835 0.4908959 -0.4869506 debye
polarizability: 165.8250141|-19.6550234|137.1576009|-2.246877|24.5970826|132.0705333 unknown
InChI: InChI=1S/C7H12Cl3O4P/c1-3-12-15(11,13-5-7(9)10)14-6(2)4-8/h5-6H,3-4H2,1-2H3
charge 0 multiplicity 1
27 atoms
Cl 3.642348 -0.165456 -1.884973
Cl -4.701877 1.730543 0.782601
Cl -3.63718 0.180204 -1.620546
P  0.304326 -0.416817 1.008282
O  1.119382 0.656434 -0.073962
O  0.818231 -1.990774 0.630416
O  -1.271634 -0.378058 0.239812
O  0.341255 -0.045013 2.546423
C  2.476653 1.170063 0.315936
C  3.189304 1.439241 -1.003667
C  2.31775 2.447282 1.156477
C  0.733698 -2.503314 -0.79123
C  1.575591 -3.771711 -0.816846
C  -2.274483 0.442253 0.781528
C  -3.377636 0.743092 0.060066
H  3.012968 0.390492 0.891198
H  4.141479 1.965618 -0.839595
H  2.542597 1.993836 -1.699076
H  3.307371 2.842342 1.450812
H  1.777577 3.225376 0.589476
H  1.750345 2.21739 2.074038
H  -0.331844 -2.692019 -1.008132
H  1.128129 -1.727221 -1.471497
H  1.519266 -4.22831 -1.822574
H  2.631492 -3.545092 -0.59428
H  1.205245 -4.5041 -0.080094
H  -2.146456 0.79282 1.812603
