program: Gaussian 09
title: 000199071
version: EM64L-G09RevD.01
frameworkgroup: C1[X(C7H8BrNO3S)]
method: RPBEPBE
basis: SDD
operation: Freq
keyword: #p
keyword: freq=noraman
keyword: PBEPBE/SDD
title: #p freq=noraman PBEPBE/SDD
converged: NO YES NO NO
title: Mulliken charges:
elementType: Br S O O O N C C C C C C C H H H H H H H H
charge: 0.021974 0.758066 -0.627206 -0.575134 -0.212595 0.098313 -0.157692 -0.218268 -0.182618 -0.167269 -0.170628 -0.615453 -0.199805 0.300245 0.263268 0.259020 0.256708 0.269163 0.251834 0.263129 0.384949
chargesum: 0.00000
title: Mulliken charges with hydrogens summed into heavy atoms:
elementType: Br S O O O N C C C C C C C
charge: 0.021974 0.758066 -0.242257 -0.575134 -0.212595 0.098313 -0.157692 0.081977 0.080650 0.091751 0.086079 0.168673 -0.199805
polarizability: 2.37050039e+02 -7.98456806e+00 1.19075173e+02 7.98419423e+00 3.46832464e+00 6.61189696e+01
1716.lowfreq: -8.0967 -2.6582 -1.1588 -0.0024 -0.0016 -0.0012 5.2409 12.7336 26.5775
frequency: -4.4499 12.4896 26.5718 39.8114 46.5756 73.7136 92.8260 108.7369 141.2766 177.9020 194.2550 225.2742 249.9983 274.0636 331.8857 373.7094 405.4019 448.5179 501.6993 530.3437 546.4985 613.5565 651.4955 686.0397 704.8323 816.9568 836.4496 843.8230 860.0882 949.1435 951.4230 980.1105 984.3411 1047.6952 1053.4019 1102.6591 1111.7458 1175.9635 1203.4652 1280.1557 1331.6088 1370.0740 1377.5993 1391.9392 1413.4877 1442.1071 1446.8487 1565.8458 1588.0903 2969.5539 3068.7848 3112.4403 3135.1095 3156.1241 3173.3097 3177.8735 3239.2860
redmass: 4.8584 5.1387 3.3420 4.0312 8.7026 5.0645 9.2189 7.5155 10.8670 1.3875 10.5285 9.0411 7.0841 13.8373 6.1259 8.2917 2.8732 7.8432 3.7962 4.3725 5.2285 7.1438 1.0572 6.8267 4.0228 1.3651 4.2721 1.3172 17.0621 1.2871 1.3710 4.2308 1.5363 6.4546 1.8350 1.3401 1.8224 1.1277 1.0936 1.2307 1.4633 3.0918 8.6087 2.0355 1.0566 1.3658 2.1160 6.1710 8.0938 1.0295 1.0966 1.1068 1.0900 1.0889 1.0949 1.0973 1.0681
irintensity: 3.5130 2.8251 0.2221 0.9708 1.1092 1.3123 0.4338 5.0831 11.1222 4.2394 5.6323 0.4893 7.6292 18.3072 3.6005 7.1609 0.0412 12.9591 29.1241 50.8346 36.6546 0.2324 119.3063 40.0464 3.1467 38.0554 44.6459 36.6889 59.0851 1.1912 0.2561 47.6777 18.2107 51.4681 6.2894 6.9917 36.0024 5.9330 53.6524 1.4948 91.8416 9.3960 7.8910 32.5083 27.9415 6.6748 56.0614 36.5940 0.5397 1.1026 1.7162 25.7646 8.7206 0.3347 4.8547 4.4315 921.3503
temp: 298.150 k
press: 1.00000 atm
elementType: 35 16 8 8 8 7 6 6 6 6 6 6 6 1 1 1 1 1 1 1 1
symmnumber: 1
zpe: 362558.1 jmol-1
zpe.correction: 0.138091 hartree
zpe.thermalcorrener: 0.153039 hartree
zpe.thermalcorrenthalpy: 0.153983 hartree
zpe.thermalcorrgfe: 0.091059 hartree
zpe.sumelectzpe: -962.326821 hartree
zpe.sumelectthermal: -962.311873 hartree
zpe.sumelectthermalent: -962.310929 hartree
zpe.sumelectthermalfe: -962.373853 hartree
dipole: -5.2383 -2.1116 -2.6728
dipole: 6.2484
quadrupole: -44.0475 -93.3623 -95.4810
quadrupole: 8.7115 7.9405 3.6209
quadrupole: 33.5828 -15.7320 -17.8507 8.7115 7.9405 3.6209
hfenergy: -962.4649121 hartree
pointgroup: C01 [X(C7H8Br1N1O3S1)]
dipole: -1.5339472 -1.7346148 -0.8254443 debye
dipolederiv: -0.6741453 -0.1194948 -0.2819529 -0.1243089 -0.077136 -0.0446265 -0.3014272 -0.0459486 -0.1669341 1.2436977 0.190259 0.1966116 0.075392 0.5933319 -0.2354407 0.0647572 -0.1901403 0.9129142 -1.0889407 -0.2908929 0.0952044 -0.1948518 -0.625137 0.0027356 0.3587496 0.2668632 -0.5770472 -0.5668872 -0.0153199 -0.1541102 0.1236359 -0.4798192 0.3091328 -0.11497 -0.057065 -0.5612237 -0.5289921 -0.1702796 -0.0561485 -0.1720388 -0.1467965 -0.023527 -0.4187896 -0.1693767 -0.5656788 0.5878565 0.2995527 0.3018259 0.3582482 -0.0489312 0.1205178 0.3797084 0.1575772 0.4382414 -0.0557858 0.0290593 0.0066696 -0.0178551 -0.085323 -0.0392563 -0.1862022 -0.0223042 -0.1485718 -0.1091256 -0.0896023 0.033106 0.2445096 -0.0211519 0.0713941 -0.1112366 -0.0483845 -0.1235623 -0.0547916 0.121848 -0.0250061 -0.2373734 -0.0060354 -0.1279018 0.0699229 -0.0202153 -0.0465691 -0.3847191 0.0972048 -0.1858945 -0.0108832 0.0413617 -0.0713974 -0.1379948 -0.0002302 -0.1632587 -0.4081528 -0.1853157 -0.0689679 -0.0733175 -0.0584389 -0.0573574 -0.1196163 -0.1247111 -0.0938805 -0.380387 -0.2032092 -0.3172423 -0.2307553 0.0653265 -0.1169053 -0.3234264 -0.1287278 -0.0633195 1.1585122 0.2373808 0.5738244 0.2469294 0.0983095 0.0359746 0.5892243 0.0345019 0.1826876 0.1713691 0.0519081 -0.0489641 -0.0060137 0.0974256 0.0215255 -0.0208288 0.0451128 0.1304311 0.079575 -0.0841202 -0.0114644 -0.0579557 0.0207962 0.0227549 -0.0198789 0.0266854 0.1318952 0.0444157 -0.0745669 -0.0287789 -0.0788536 0.0013788 0.0290758 -0.0286586 0.0317567 0.1363743 0.0467688 0.0353101 -0.0721488 0.0286599 0.0425959 0.0709884 -0.0778583 0.0765652 0.0909801 0.0802373 -0.0317745 -0.0443333 0.0278344 0.029555 0.076462 0.037928 0.1026071 0.1380425 -0.0460735 -0.0687749 0.0161304 -0.0731689 0.1066486 0.0043734 0.1094012 0.0406197 -0.0235045 0.0441006 0.0489263 0.0180584 -0.0112309 0.039986 -0.0919502 0.0927118 -0.0526294 0.1332148 0.8414676 0.2219019 0.0535813 0.1833976 0.4120532 0.0434277 0.1584845 0.0774439 0.2387689 unknown
polarizability: 208.4691414|33.5028903|109.4212211|55.5325396|-11.993257|104.3538188 unknown
InChI: InChI=1S/C6H5BrO2S.CH3NO/c7-5-1-3-6(4-2-5)10(8)9;1-2-3/h1-4,8H;1H3
charge 0 multiplicity 1
21 atoms
Br 5.505039 1.033252 1.824712
S  -0.377971 -0.080663 -1.004748
O  -1.19145 -0.441877 0.644259
O  -0.777082 1.414771 -1.553552
O  -3.792921 -1.373443 -0.057078
N  -3.930073 -1.448654 -1.324956
C  1.285164 0.206949 -0.157105
C  1.894145 1.455366 -0.362126
C  1.874841 -0.804987 0.621742
C  3.152334 1.70628 0.230011
C  3.134349 -0.558969 1.215167
C  -5.271322 -1.970338 -1.742567
C  3.754336 0.692396 1.005481
H  1.372441 2.214808 -0.956998
H  1.361389 -1.755496 0.795134
H  3.648464 2.670689 0.091138
H  3.614385 -1.323365 1.832213
H  -5.720718 -1.194947 -2.392281
H  -5.924151 -2.21595 -0.887778
H  -5.081477 -2.850812 -2.385389
H  -2.131721 -0.757706 0.438223
