program: Gaussian 09
title: 000199083
version: EM64L-G09RevD.01
frameworkgroup: C1[X(C16H18N2O4)]
method: RPBEPBE
basis: SDD
operation: Freq
keyword: #p
keyword: freq=noraman
keyword: PBEPBE/SDD
title: #p freq=noraman PBEPBE/SDD
converged: YES YES NO NO
title: Mulliken charges:
elementType: O O O O N N C C C C C C C C C C C C C C C C H H H H H H H H H H H H H H H H H H
charge: -0.290669 -0.285680 -0.290658 -0.287150 -0.402168 -0.007350 0.381488 -0.493590 -0.556785 -0.521323 0.059920 0.238315 0.295187 0.156993 0.495551 -0.368640 -0.321174 -0.324894 -0.333666 -0.521663 -0.498372 -0.532503 0.229357 0.275174 0.289373 0.235414 0.314568 0.233562 0.249229 0.240275 0.240212 0.270363 0.205594 0.231505 0.254209 0.205523 0.228717 0.233957 0.229939 0.241862
chargesum: 0.00000
title: Mulliken charges with hydrogens summed into heavy atoms:
elementType: O O O O N N C C C C C C C C C C C C C C C C
charge: -0.290669 -0.285680 -0.290658 -0.287150 -0.087601 -0.007350 0.381488 0.010941 -0.267413 -0.285909 0.059920 0.238315 0.295187 0.156993 0.495551 -0.135078 -0.071945 -0.084619 -0.093455 0.185799 0.190077 0.173255
polarizability: 2.96579045e+02 -6.64952225e+00 2.05897050e+02 2.06843449e+01 5.29788745e+00 1.34458736e+02
1716.lowfreq: -4.0576 -0.0005 -0.0001 0.0007 5.1524 7.6711 17.3526 26.3984 28.3298
frequency: 16.9020 26.3430 28.2777 43.9220 50.3170 69.4647 92.8554 100.9310 107.3870 138.4876 148.8571 175.5735 190.6311 205.6234 212.7135 218.5042 227.2496 256.5466 269.5686 277.3719 306.5856 321.2941 348.5265 367.6653 373.7074 430.9938 441.3525 476.4728 506.6667 529.6388 549.1389 570.0424 589.1506 609.4595 651.5804 662.1036 685.9814 736.4583 737.6676 748.0243 758.6682 806.2716 825.9856 854.1987 865.5562 884.2948 887.6893 891.6264 947.5595 959.9418 960.7113 976.8984 982.5081 1021.4594 1061.1200 1061.7547 1072.7030 1087.6587 1108.4523 1108.8344 1112.3937 1119.4804 1149.9648 1153.6423 1159.1117 1187.7057 1213.3041 1218.4254 1225.4985 1233.6061 1250.6790 1296.6144 1311.0824 1326.9390 1361.6393 1382.4424 1401.2553 1405.8031 1417.7752 1441.1141 1443.8827 1450.6450 1454.8030 1462.1005 1463.5728 1465.7961 1471.2808 1472.1323 1477.1956 1484.2078 1499.3761 1560.4432 1566.2707 1588.1794 1597.5789 1604.6820 2970.2507 2971.6558 2977.8019 2978.9519 3031.6581 3063.5269 3085.0204 3090.3471 3123.5832 3127.7074 3128.3066 3130.3220 3130.4554 3146.6449 3149.9156 3158.7241 3174.7510 3563.8875
redmass: 5.4555 5.3398 4.1610 4.9635 3.7178 4.1386 3.4947 2.2082 2.6364 3.0851 1.7947 3.9112 1.7919 2.0596 2.2930 4.4699 3.5165 3.1500 1.9903 2.7308 4.9825 4.6765 5.0304 2.5157 4.5776 4.1036 5.1966 4.6236 5.0334 5.2820 2.2471 3.3307 4.2551 2.2410 4.9820 6.8980 4.8055 5.6963 3.3845 3.7583 4.5014 1.8874 2.2874 1.6423 6.3545 2.1454 1.3063 2.6283 9.0431 2.8959 2.0234 1.6462 3.2063 2.7846 2.8774 2.5416 5.2414 1.5899 1.2461 1.2493 1.2589 2.5258 1.3902 1.4092 1.5450 3.0981 1.6183 1.5769 1.6663 1.3017 1.9448 3.1356 5.5712 1.7553 1.3725 4.6851 3.1671 2.0127 1.2470 1.2264 1.3547 1.1907 1.0994 1.5595 1.6333 1.0616 1.0653 1.2600 1.1833 1.0573 2.5010 6.4660 7.3377 5.5553 7.3921 6.4278 1.0349 1.0334 1.0594 1.0354 1.1003 1.1044 1.0950 1.0966 1.0874 1.1056 1.1009 1.1050 1.0884 1.0971 1.0911 1.0975 1.0909 1.0773
irintensity: 0.5575 0.8314 0.1262 3.2138 10.5956 3.7099 2.4952 1.1681 4.4944 8.1368 4.3547 4.0818 0.4846 1.6968 1.3607 4.9621 5.6675 11.1529 0.2537 2.9209 1.9810 10.5480 6.8467 0.6787 1.0245 17.0224 14.2848 13.2485 30.3408 3.7585 38.7433 15.0157 3.2934 65.9717 6.6307 0.3794 13.8370 29.0935 5.0707 3.6830 9.0535 29.5595 22.6726 6.1219 12.6971 25.9122 3.8068 21.8037 58.3199 6.8074 1.1652 6.6452 22.7655 4.3021 25.7992 3.9882 241.0922 4.4343 20.6806 6.1471 0.1697 9.9611 2.4959 27.0863 58.1428 78.9709 2.8027 20.7153 6.8156 56.8693 72.8839 13.3077 356.0963 58.6802 8.9199 44.3000 49.9508 24.6976 13.3592 2.5324 16.5924 76.0245 18.8254 113.8124 167.8757 22.7651 43.5405 12.3666 43.5797 12.5746 167.3890 27.8140 276.8611 58.1057 10.4885 11.3845 88.4442 52.1148 69.4881 64.6459 22.3435 36.7602 35.8421 45.9348 7.1437 17.9947 22.3108 14.3777 14.3750 43.3599 5.9075 6.5028 5.1401 12.8817
temp: 298.150 k
press: 1.00000 atm
elementType: 8 8 8 8 7 7 6 6 6 6 6 6 6 6 6 6 6 6 6 6 6 6 1 1 1 1 1 1 1 1 1 1 1 1 1 1 1 1 1 1
symmnumber: 1
zpe: 825770.6 jmol-1
zpe.correction: 0.314519 hartree
zpe.thermalcorrener: 0.336438 hartree
zpe.thermalcorrenthalpy: 0.337382 hartree
zpe.thermalcorrgfe: 0.260748 hartree
zpe.sumelectzpe: -1029.236648 hartree
zpe.sumelectthermal: -1029.214730 hartree
zpe.sumelectthermalent: -1029.213786 hartree
zpe.sumelectthermalfe: -1029.290420 hartree
dipole: 4.1647 0.1239 -0.3435
dipole: 4.1806
quadrupole: -127.3297 -125.1194 -127.1351
quadrupole: 5.3998 23.7181 4.2848
quadrupole: -0.8016 1.4087 -0.6070 5.3998 23.7181 4.2848
hfenergy: -1029.5511676 hartree
pointgroup: C01[X(C16H18N2O4)]
dipole: 1.6261745 -0.2100816 -0.1294885 debye
polarizability: 295.8780235|-7.4799722|194.2739953|19.2102601|-29.5869596|146.782812 unknown
InChI: InChI=1S/C16H18N2O4/c1-20-13-8-12(9-14(21-2)15(13)22-3)16(19)18-10-11-4-6-17-7-5-11/h4-9,18H,10H2,1-3H3
charge 0 multiplicity 1
40 atoms
O  4.674385 0.114044 -0.730532
O  2.420284 1.597466 -1.862141
O  4.136992 -1.951701 1.063772
O  -1.010599 -2.136711 1.445995
N  -1.759859 -0.930169 -0.393872
N  -5.880088 2.130321 0.186884
C  0.644734 -0.919075 0.146344
C  -3.16516 -1.298578 -0.186827
C  1.697006 -1.623701 0.780768
C  0.941835 0.156823 -0.715101
C  3.354522 -0.184474 -0.353984
C  2.285065 0.534126 -0.963392
C  3.034244 -1.270115 0.525022
C  -0.755595 -1.37335 0.458256
C  -4.094265 -0.096411 -0.074588
C  -5.374658 -0.105204 -0.679382
C  -3.727324 1.05729 0.662946
C  -6.223824 1.014303 -0.52245
C  -4.640049 2.129919 0.765648
C  5.635993 0.44638 0.345112
C  3.606146 2.473148 -1.834292
C  3.860429 -3.133069 1.889959
H  -3.514347 -1.966776 -0.998575
H  -3.178595 -1.888761 0.750454
H  1.423393 -2.439578 1.454486
H  0.171468 0.77748 -1.183956
H  -1.516458 -0.39063 -1.224976
H  -5.711285 -0.967527 -1.266643
H  -2.747849 1.116619 1.148928
H  -7.218541 1.03077 -0.982572
H  -4.381586 3.031495 1.332807
H  5.748683 -0.401229 1.03897
H  5.301295 1.348862 0.893921
H  6.583856 0.651654 -0.175217
H  4.489181 1.958682 -2.24247
H  3.819932 2.818958 -0.804703
H  3.323717 3.331537 -2.463803
H  3.299907 -3.89486 1.316334
H  3.294117 -2.862711 2.801259
H  4.850001 -3.525344 2.166509
