program: Gaussian 09
title: 000199035
version: EM64L-G09RevD.01
frameworkgroup: C1[X(C7H6N4S)]
method: RPBEPBE
basis: SDD
operation: Freq
keyword: #pfreq=noraman
keyword: PBEPBE/SDD
title: #p freq=noraman PBEPBE/SDD
converged: YES YES NO NO
title: Mulliken charges:
elementType: S N N N N C C C C C C C H H H H H H
charge: 0.284303 -0.057748 -0.059672 -0.087621 -0.573139 0.244431 -0.306408 -0.266911 -0.187082 -0.142229 -0.168976 -0.359292 0.279804 0.242536 0.233601 0.244430 0.342815 0.337158
chargesum: 0.00000
title: Mulliken charges with hydrogens summed into heavy atoms:
elementType: S N N N N C C C C C C C
charge: 0.284303 -0.057748 -0.059672 -0.087621 0.106834 0.244431 -0.306408 0.012894 0.055454 -0.142229 0.064625 -0.114863
polarizability: 2.25471413e+02 -2.77073404e+00 1.17389709e+02 4.61032252e-03 1.06444103e-02 4.56962414e+01
1716.lowfreq: -12.0332 -2.9801 -0.0017 -0.0012 0.0010 6.1479 69.1248 79.1569 105.6295
frequency: 69.1172 79.1425 105.6088 177.4510 282.7345 301.7404 317.8795 345.1125 406.2547 418.3517 462.2364 505.7116 561.9270 579.7119 590.0855 596.7237 609.8955 676.5150 746.7193 756.1578 792.8784 906.3461 937.0421 954.0902 963.2278 969.0866 1005.3453 1035.3259 1077.4958 1098.7387 1162.4832 1238.9475 1275.4008 1291.1846 1321.3032 1409.7522 1430.5988 1496.1410 1503.2183 1555.2551 1579.3624 1616.3567 3133.6671 3146.1152 3168.2434 3179.5427 3553.6371 3708.5810
redmass: 6.0151 5.6575 5.9506 5.5838 7.1252 2.4769 4.3358 1.5376 3.5814 7.8821 1.5503 2.3222 5.9478 10.9185 5.7892 7.4816 7.4736 7.8567 1.9640 9.3203 1.9986 1.3133 7.3284 4.0041 1.4411 4.2589 1.3365 2.3024 2.3048 2.6679 1.0754 3.0862 1.9896 2.5050 9.9918 2.0269 2.2541 6.9967 4.6400 5.7983 5.5753 1.3000 1.0882 1.0901 1.0955 1.1004 1.0456 1.1041
irintensity: 11.6229 2.6662 12.2845 1.1817 1.3709 16.6922 3.7527 58.4058 8.6479 0.1878 207.0381 32.3453 3.0424 1.4676 6.4516 24.4692 7.0142 27.4454 29.5961 6.2818 52.1456 0.6796 20.8374 24.3666 1.8258 0.9444 0.5330 2.1549 24.1051 69.3588 2.2111 16.2137 21.2963 35.4700 1.3482 23.7708 10.8389 319.4393 197.4778 9.1416 55.6508 309.6510 12.9870 13.6611 18.8979 13.9180 179.8436 58.5452
temp: 298.150 k
press: 1.00000 atm
elementType: 16 7 7 7 7 6 6 6 6 6 6 6 1 1 1 1 1 1
symmnumber: 1
zpe: 329561.9 jmol-1
zpe.correction: 0.125523 hartree
zpe.thermalcorrener: 0.135617 hartree
zpe.thermalcorrenthalpy: 0.136562 hartree
zpe.thermalcorrgfe: 0.089353 hartree
zpe.sumelectzpe: -886.540265 hartree
zpe.sumelectthermal: -886.530171 hartree
zpe.sumelectthermalent: -886.529227 hartree
zpe.sumelectthermalfe: -886.576435 hartree
dipole: -0.3341 -1.8094 0.0025
dipole: 1.8400
quadrupole: -41.1571 -79.1295 -80.3031
quadrupole: 9.9923 -0.0056 0.0028
quadrupole: 25.7062 -12.2662 -13.4399 9.9923 -0.0056 0.0028
hfenergy: -886.6657883 hartree
pointgroup: C01 [X(C7H6N4S1)]
dipole: 0.0922346 -0.7180175 -0.0009982 debye
dipolederiv: -0.2099507 0.0939856 0.0000813 0.034957 -0.4277873 0.0003598 0.0004221 0.0002805 0.1128647 -0.5104608 -0.0267626 -0.0000273 -0.220769 -0.3039892 0.0000013 -0.0000862 -0.0000116 -0.2141167 0.7574989 0.1506591 -0.0000529 0.1508948 -0.4860988 0.000145 -0.0003348 -0.0000587 -0.1431732 -1.1576424 -0.1573874 0.0000751 1.0661804 -0.4772496 -0.0001187 0.0007432 -0.0001335 -0.2208388 -1.7838843 0.3462329 0.0004206 0.5713537 -0.2822166 -0.0002557 0.0005528 -0.0002933 -0.6864863 0.9340144 0.0364952 0.00004 0.0536218 -0.0086412 0.0000586 0.0004345 -0.0000238 0.0842848 -0.1712033 -0.2274201 0.0004195 -0.8274433 0.610592 -0.0003893 -0.0003304 -0.0000728 -0.0539028 -0.5361289 0.0680591 -0.0000636 0.2554924 0.0027329 0.0000173 -0.0001399 0.0000068 -0.089674 0.3411061 -0.0748817 0.000083 0.0372638 0.164814 -0.000036 0.0001025 -0.0000495 -0.1198923 1.7838632 -0.1630746 -0.0011511 -1.0852546 0.7005531 0.0000973 -0.0012649 0.0001925 0.106462 -0.0723809 0.0816631 0.0000265 -0.2574894 -0.2331667 -0.000028 0.0000186 0.0000404 -0.1233465 0.072613 -0.0018227 0.0000258 0.3744552 0.3641236 0.000018 -0.0000614 -0.0000307 -0.0765501 0.0992738 -0.0715589 -0.0000017 -0.0465398 0.0154042 0.0000073 -0.0000124 -0.0000021 0.1625714 0.0075532 0.0917003 -0.0000402 0.1114109 -0.027292 0.0000409 -0.0000392 0.0000434 0.148492 -0.11972 -0.032802 -0.0000593 -0.0221287 0.0971129 0.0000002 -0.0000547 -0.0000012 0.1692253 0.0187767 -0.0623796 -0.000022 -0.1218766 -0.0731279 -0.0000021 -0.0000009 -0.0000027 0.1355752 0.3070673 0.0079115 0.0000997 0.0746504 0.1651318 -0.000002 0.0000672 0. 0.4016467 0.2396047 -0.0586173 0.0001468 -0.148779 0.1991047 0.0000861 -0.0000161 0.0001162 0.4068587 unknown
polarizability: 225.4499929|-3.160961|117.4111295|0.00402|-0.0108811|45.6962414 unknown
InChI: InChI=1S/C7H6N4S/c8-7-11-10-6(12-7)5-3-1-2-4-9-5/h1-4H,8H2
charge 0 multiplicity 1
18 atoms
S  1.591485 -1.417805 0.001606
N  -1.419156 -1.224491 0.000343
N  1.289266 1.2501 0.000959
N  2.671714 1.059733 0.000752
N  4.304791 -0.67301 -0.000486
C  -0.883764 0.040831 0.00034
C  0.574209 0.128197 0.000685
C  -1.685159 1.216332 0.000032
C  -3.085855 1.073879 -0.000276
C  3.001237 -0.250338 0.000328
C  -3.649475 -0.225713 -0.000275
C  -2.776072 -1.337992 0.000032
H  -1.195629 2.193964 0.000041
H  -3.729839 1.959504 -0.000517
H  -4.733205 -0.376511 -0.000504
H  -3.168223 -2.361296 0.000039
H  5.032035 0.040175 -0.001035
H  4.55904 -1.655457 -0.000464
