program: Gaussian 09
title: 000199028
version: EM64L-G09RevD.01
frameworkgroup: C1[X(C10H11NO5)]
method: RPBEPBE
basis: SDD
operation: Freq
keyword: #p
keyword: freq=noraman
keyword: PBEPBE/SDD
title: #p freq=noraman PBEPBE/SDD
converged: YES YES NO NO
title: Mulliken charges:
elementType: O O O O O N C C C C C C C C C C H H H H H H H H H H H
charge: -0.379516 -0.402336 -0.237277 -0.456409 -0.218647 -0.580998 -0.614714 -0.166961 0.564115 -0.492699 -0.376768 0.150565 -0.386266 0.163124 0.185124 0.097733 0.235795 0.213440 0.258974 0.296577 0.235124 0.219697 0.273020 0.298476 0.357401 0.380660 0.382765
chargesum: 0.00000
title: Mulliken charges with hydrogens summed into heavy atoms:
elementType: O O O O O N C C C C C C C C C C
charge: -0.022115 -0.021676 -0.237277 -0.073644 -0.218647 -0.009502 -0.165479 0.092012 0.564115 -0.196122 -0.141643 0.150565 -0.166569 0.163124 0.185124 0.097733
polarizability: 1.75142173e+02 5.71074946e+00 1.44806110e+02 2.38488177e+01 -1.00734219e+01 8.46415859e+01
1716.lowfreq: -7.3712 -3.8848 -0.0008 -0.0008 -0.0007 6.0964 15.3436 24.8002 31.5552
frequency: 14.6278 24.6492 31.5401 44.7360 74.3334 118.3151 147.2441 188.8969 234.9214 238.3034 275.0039 295.5679 306.3438 362.0105 369.8855 384.1270 403.2600 424.6462 446.9556 504.4490 521.6177 548.8373 564.7801 593.3053 597.5979 614.9680 623.8750 691.9223 708.7566 728.2520 766.9489 768.0222 778.3027 813.6106 902.0851 921.0790 951.4322 963.1982 973.7318 987.6875 1061.1037 1092.1233 1108.2425 1134.9085 1147.8067 1169.7076 1188.1310 1226.2722 1255.6262 1265.9512 1285.2475 1297.7204 1308.4416 1318.1561 1397.6548 1403.4047 1410.4815 1464.0827 1499.5190 1597.5752 1612.4159 1616.7527 1654.4612 1668.4991 2987.0818 3036.1801 3058.7063 3110.4002 3135.7253 3163.5119 3474.5264 3499.4933 3533.1293 3548.1428 3612.1460
redmass: 6.6171 11.0682 9.4577 6.8079 4.8751 5.2908 5.4355 5.0892 1.6672 4.7293 3.6516 2.4299 2.6746 4.7176 3.9597 8.8681 1.1929 2.7059 4.8345 3.7074 2.6164 1.7763 2.4535 1.4338 2.5780 4.9814 1.5064 4.6314 4.5604 4.8408 4.0541 3.0551 4.8569 1.6509 4.2799 1.8144 1.6377 1.5928 3.5478 3.7527 2.7352 1.9041 1.6019 1.5079 1.3716 1.2036 1.4996 2.3628 2.7890 1.6507 1.3518 1.7928 2.0128 1.1899 4.1255 3.3038 2.3292 1.1181 2.8853 6.3861 1.3444 6.5535 8.6299 3.5278 1.0605 1.0887 1.1002 1.0873 1.0968 1.0920 1.0447 1.0638 1.0642 1.0658 1.0991
irintensity: 0.1874 1.3631 2.0183 0.5040 1.9352 1.2492 3.3308 2.2552 50.0640 2.1951 14.3411 17.5921 3.1855 2.2521 1.6985 5.1978 131.8491 0.0421 16.0227 36.3083 23.2200 88.4523 186.4502 90.5263 43.1701 26.0159 295.7632 1.7173 16.1305 20.7370 4.2884 1.7672 17.5346 43.0430 30.4947 4.0948 7.1941 21.0520 80.1990 160.3858 225.4180 111.3421 1.4923 27.9094 159.2466 21.6299 7.8204 7.8479 29.3814 5.8629 1.7185 82.3775 60.8083 1.9442 15.8510 4.5432 28.2168 12.3954 61.6481 47.9794 170.1140 1.4685 332.6607 117.6913 35.1579 9.3534 19.4997 15.1612 16.4779 2.4187 11.5431 20.6624 40.0289 37.9597 8.9584
temp: 298.150 k
press: 1.00000 atm
elementType: 8 8 8 8 8 7 6 6 6 6 6 6 6 6 6 6 1 1 1 1 1 1 1 1 1 1 1
symmnumber: 1
zpe: 527871.1 jmol-1
zpe.correction: 0.201055 hartree
zpe.thermalcorrener: 0.216941 hartree
zpe.thermalcorrenthalpy: 0.217885 hartree
zpe.thermalcorrgfe: 0.154972 hartree
zpe.sumelectzpe: -817.354658 hartree
zpe.sumelectthermal: -817.338773 hartree
zpe.sumelectthermalent: -817.337828 hartree
zpe.sumelectthermalfe: -817.400741 hartree
dipole: -1.4136 -3.5952 -0.6259
dipole: 3.9136
quadrupole: -108.1238 -77.0339 -88.9273
quadrupole: 0.3999 7.1915 -0.3790
quadrupole: -16.7621 14.3278 2.4344 0.3999 7.1915 -0.3790
hfenergy: -817.5557137 hartree
pointgroup: C01 [X(C10H11N1O5)]
dipole: -0.4249029 1.4784835 0.0652666 debye
polarizability: 173.1571103|-11.6408965|143.1109002|-24.6602391|-15.188031|88.3218587 unknown
InChI: InChI=1S/C10H11NO5/c11-7(10(15)16)4-5-1-2-8(12)6(3-5)9(13)14/h1-3,7,12-13,15H,4,11H2
charge 0 multiplicity 1
27 atoms
O  3.594178 0.882184 -0.918869
O  -1.96981 -0.65885 -1.846737
O  -3.14487 -1.733642 -0.156544
O  1.794288 -2.51109 1.005318
O  3.737868 -1.708148 0.031745
N  -4.300745 0.802194 0.383354
C  -1.833704 0.952836 1.042251
C  -2.916796 0.719492 -0.091537
C  -0.39637 0.944471 0.555905
C  0.41336 -0.203322 0.681197
C  0.164794 2.085998 -0.075519
C  1.750876 -0.254141 0.199664
C  1.482182 2.069367 -0.564122
C  2.286106 0.907406 -0.436035
C  -2.720133 -0.676136 -0.675249
C  2.551888 -1.493672 0.370061
H  -1.995109 0.180546 1.817332
H  -2.081157 1.933017 1.494784
H  -2.746504 1.459434 -0.893088
H  0.019575 -1.101496 1.166451
H  -0.433797 2.999106 -0.181287
H  1.899285 2.962729 -1.047495
H  -4.556096 1.684947 0.830725
H  -4.618398 -0.031715 0.886485
H  3.824589 1.752023 -1.335064
H  -1.810116 -1.592686 -2.156339
H  2.379718 -3.309651 1.096511
