program: Gaussian 09
title: 000199032
version: EM64L-G09RevD.01
frameworkgroup: C1[X(C14H16O3)]
method: RPBEPBE
basis: SDD
operation: Freq
keyword: #pfreq=noraman
keyword: PBEPBE/SDD
title: #p freq=noraman PBEPBE/SDD
converged: NO YES NO NO
title: Mulliken charges:
elementType: O O O C C C C C C C C C C C C C C H H H H H H H H H H H H H H H H
charge: -0.192936 -0.431863 -0.214551 0.149862 -0.505222 -0.403393 0.103365 -0.403808 -0.506909 -0.524190 0.380103 -0.377101 -0.398187 0.168081 -0.239120 -0.247276 -0.240790 0.208950 0.255879 0.209863 0.221282 0.208877 0.219680 0.236886 0.242253 0.275872 0.242401 0.253368 0.244606 0.228488 0.226504 0.230725 0.378299
chargesum: 0.00000
title: Mulliken charges with hydrogens summed into heavy atoms:
elementType: O O O C C C C C C C C C C C C C C
charge: -0.192936 -0.053564 -0.214551 0.149862 -0.040392 0.027753 0.103365 0.024749 -0.027769 -0.005916 0.380103 -0.123733 -0.153582 0.168081 -0.010632 -0.020772 -0.010065
polarizability: 1.60249126e+02 1.74728037e+01 1.36579421e+02 2.81430028e+00 -2.60564335e+00 1.48855586e+02
1716.lowfreq: -9.6487 -6.8351 0.0004 0.0004 0.0006 11.4520 27.5100 45.7447 53.3525
frequency: 27.2377 45.6496 53.2413 70.6563 90.3335 122.0430 136.6986 179.8326 226.2728 251.6292 253.8137 301.1414 353.9010 366.7504 404.6760 405.3281 426.2660 461.7302 488.7960 512.8329 540.8732 581.9139 612.6841 618.7555 657.5387 684.6956 705.2003 715.7983 760.2851 796.8565 800.9883 835.6096 857.0289 869.3110 887.4843 905.3137 926.7114 956.6621 961.4179 982.3941 991.4335 998.4339 1025.2217 1030.9663 1051.2284 1080.8428 1082.4214 1091.3777 1114.8118 1120.9964 1139.6275 1172.7971 1175.7336 1198.2167 1213.4304 1239.5614 1256.1452 1262.8279 1298.7584 1304.0214 1315.3975 1327.0706 1337.5063 1341.0194 1349.7817 1375.9129 1435.3286 1445.1918 1447.4326 1466.6211 1469.3645 1481.0745 1486.7774 1588.7672 1608.0924 1618.1527 1667.4146 2981.0730 2983.1790 2989.0354 2992.5845 3017.4404 3040.0691 3051.7588 3062.9581 3079.4418 3106.9917 3117.5186 3126.3963 3140.2266 3152.5762 3165.4977 3505.5258
redmass: 9.1988 4.5722 5.9548 5.5009 4.7973 4.1769 2.9941 3.6979 5.4295 2.7922 4.1727 3.0598 3.7040 2.4842 2.8251 3.7780 2.2199 4.0910 2.0145 3.5734 3.5168 3.5710 2.2830 3.0432 2.8265 2.9505 2.3336 2.3908 2.1006 2.4940 2.7425 1.9995 1.2669 2.5764 2.9875 1.5749 1.4315 2.2938 2.4286 1.3924 5.8683 1.3316 2.3583 2.1598 2.6531 1.7738 2.0422 1.5414 2.2904 1.9607 1.8003 1.5070 1.2370 1.1219 1.6521 1.7687 1.2751 1.6356 1.4084 1.4221 1.8231 1.3809 1.3832 1.3952 1.4666 6.7779 2.2183 1.0868 1.0981 1.0842 1.0987 1.4726 1.4015 5.9930 6.5292 8.8398 8.4658 1.0681 1.0607 1.0630 1.0616 1.0638 1.0992 1.1007 1.0959 1.1001 1.0971 1.0874 1.0863 1.0919 1.0946 1.1010 1.0637
irintensity: 1.0079 0.7338 0.2085 1.9917 0.6149 1.0683 0.0425 0.2105 2.0572 0.6538 0.2890 1.5809 1.1821 0.1923 0.0876 3.3975 2.3808 1.8291 8.1339 19.9394 28.7119 13.2253 69.7473 43.4798 43.8945 7.5101 40.3802 27.7237 19.7138 12.1752 9.0284 15.4438 2.3224 14.6742 10.6492 3.2220 2.0743 3.7647 2.9791 0.5156 1.3352 0.1028 46.6049 46.1777 11.2822 40.4177 37.5296 3.9044 22.9036 30.0784 31.7863 10.7871 5.1506 0.2143 3.5576 23.5804 3.2554 10.9106 12.5891 11.0458 15.9592 1.2618 1.3838 0.9825 2.2133 0.0693 6.0794 16.4484 15.2374 8.7666 13.0888 33.5785 4.4751 10.2790 50.3123 87.4503 244.1553 20.6115 34.7807 26.5176 15.4737 11.2219 41.1481 47.9347 21.9372 28.7524 4.4768 4.1238 0.5723 16.1951 31.2684 18.3182 20.5120
temp: 298.150 k
press: 1.00000 atm
elementType: 8 8 8 6 6 6 6 6 6 6 6 6 6 6 6 6 6 1 1 1 1 1 1 1 1 1 1 1 1 1 1 1 1
symmnumber: 1
zpe: 705547.8 jmol-1
zpe.correction: 0.268729 hartree
zpe.thermalcorrener: 0.284237 hartree
zpe.thermalcorrenthalpy: 0.285181 hartree
zpe.thermalcorrgfe: 0.224926 hartree
zpe.sumelectzpe: -767.514036 hartree
zpe.sumelectthermal: -767.498527 hartree
zpe.sumelectthermalent: -767.497583 hartree
zpe.sumelectthermalfe: -767.557838 hartree
dipole: 0.8512 -1.6742 -3.8093
dipole: 4.2472
quadrupole: -100.6847 -96.4347 -101.4299
quadrupole: 3.3314 0.3773 -6.8183
quadrupole: -1.1683 3.0817 -1.9134 3.3314 0.3773 -6.8183
hfenergy: -767.7827647 hartree
pointgroup: C01 [X(C14H16O3)]
dipole: -0.1075769 0.4752882 -1.5983259 debye
polarizability: 167.5189193|8.7346947|131.0061947|-2.9067886|6.3736287|147.1590191 unknown
InChI: InChI=1S/C14H16O3/c15-12-8-4-5-9-14(12,10-13(16)17)11-6-2-1-3-7-11/h1-3,6-7,16H,4-5,8-10H2
charge 0 multiplicity 1
33 atoms
O  -2.127799 0.334488 2.128232
O  0.381379 -3.08666 -0.667428
O  1.658964 -2.739631 1.232436
C  -0.776286 -0.342269 0.172756
C  -1.518342 -0.701414 -1.161058
C  -1.988725 0.530729 -1.966953
C  -1.738687 0.59999 0.95988
C  -2.920602 1.425866 -1.121828
C  -2.226491 1.834118 0.209808
C  -0.535959 -1.62313 1.046946
C  0.574051 0.387383 -0.035865
C  1.144886 1.110776 1.045462
C  1.30767 0.296601 -1.245186
C  0.612211 -2.499349 0.594797
C  2.403417 1.736126 0.918287
C  2.569789 0.919465 -1.374383
C  3.122542 1.64474 -0.295484
H  -2.408497 -1.305928 -0.890985
H  -0.880726 -1.365282 -1.769062
H  -2.51698 0.187604 -2.87715
H  -1.118886 1.125045 -2.306791
H  -3.858133 0.881093 -0.892903
H  -3.203211 2.33776 -1.680226
H  -2.908295 2.398171 0.868641
H  -1.355655 2.47646 -0.027105
H  -0.32547 -1.316638 2.083069
H  -1.465262 -2.222487 1.061991
H  0.606474 1.177006 1.999304
H  0.905168 -0.267857 -2.0921
H  2.824949 2.286801 1.766586
H  3.121959 0.834418 -2.317326
H  4.101172 2.126855 -0.396189
H  1.165774 -3.656749 -0.896071
