program: Gaussian 09
title: 000199007
version: EM64L-G09RevD.01
frameworkgroup: C1[X(C15H11NO4)]
method: RPBEPBE
basis: SDD
operation: Freq
keyword: #p
keyword: freq=noraman
keyword: PBEPBE/SDD
title: #p freq=noraman PBEPBE/SDD
converged: YES YES NO NO
title: Mulliken charges:
elementType: O O O O N C C C C C C C C C C C C C C C H H H H H H H H H H H
charge: -0.270698 -0.445827 -0.206811 -0.205780 0.028163 -0.371300 0.374204 0.466242 0.295575 -0.474683 0.174649 -0.412382 -0.337564 -0.412197 -0.360636 -0.351422 -0.349799 0.375539 -0.236316 -0.216658 0.230985 0.290856 0.248531 0.274574 0.247064 0.253943 0.287768 0.287767 0.226727 0.358948 0.230539
chargesum: 0.00000
title: Mulliken charges with hydrogens summed into heavy atoms:
elementType: O O O O N C C C C C C C C C C C C C C C
charge: -0.270698 -0.086879 -0.206811 -0.205780 0.028163 -0.140316 0.374204 0.466242 0.295575 -0.183827 0.174649 -0.163851 -0.062990 -0.165133 -0.106694 -0.063655 -0.062032 0.375539 -0.009588 0.013881
polarizability: 2.61819149e+02 1.13256992e+00 1.53543027e+02 1.66802191e+01 1.57114058e+01 1.58227970e+02
1716.lowfreq: -14.4999 -5.1672 0.0006 0.0006 0.0007 2.1023 11.1314 20.5381 26.6239
frequency: 10.4848 20.3616 26.6137 64.5669 86.1495 128.3354 142.3367 167.5658 230.7120 244.0637 283.1541 283.4962 301.7097 313.9692 366.5512 407.1375 426.0254 439.4682 457.0396 504.5165 527.8363 565.0139 568.5428 599.5809 606.4451 625.2387 659.2361 670.0811 713.6863 748.2671 753.8724 754.8123 773.7583 800.4447 825.5707 848.9987 852.3155 861.8403 868.5458 876.9152 920.9166 940.2472 979.1805 986.2142 992.9149 996.3424 1006.5034 1006.9165 1091.5482 1093.7798 1109.3697 1118.2522 1156.0903 1159.7919 1177.5534 1179.6040 1194.5899 1219.4507 1227.8357 1255.4988 1267.8430 1307.7240 1310.5693 1361.9819 1368.4794 1404.8481 1411.8571 1422.4630 1439.7033 1464.0824 1476.7780 1592.8469 1599.4928 1605.3143 1608.3710 1624.4007 2944.9014 3134.7761 3141.3012 3148.5221 3155.8313 3163.0995 3176.8688 3183.3716 3185.6886 3245.1794 3569.0895
redmass: 5.2359 5.2620 6.9927 7.2327 7.4029 6.4813 7.6295 6.8110 6.1973 4.2851 6.1463 4.7738 2.7870 1.5521 5.9476 2.8736 3.2213 5.4102 5.1429 7.3456 3.9779 7.9782 3.7870 5.8134 6.2546 6.9386 6.2847 4.6840 4.8441 4.0932 4.8882 1.2468 6.6064 4.1789 4.0806 1.3945 1.2605 2.9154 1.7464 1.8442 6.2082 1.3861 1.3077 1.6149 3.7900 1.3834 2.0972 3.0660 3.3416 2.3502 1.3213 1.4846 2.1040 1.2153 1.3181 1.4386 2.4635 4.9939 1.9650 2.1481 1.3521 1.6408 1.5083 1.7705 6.4210 6.9442 4.5919 3.3772 2.9565 2.8967 2.4022 7.0297 7.7233 6.6870 7.2826 8.0179 1.0831 1.0857 1.0908 1.0908 1.0899 1.0963 1.0991 1.0946 1.0958 1.0986 1.0663
irintensity: 0.1197 0.9119 0.3950 0.1561 2.2353 3.2980 6.5152 2.6074 1.3494 5.2591 8.8467 11.7415 48.8330 123.4921 4.2768 0.3160 13.0231 2.8184 1.3834 1.3927 13.4544 2.8823 0.0478 1.5895 0.5735 0.3196 2.6453 24.0623 19.8896 6.9540 5.2187 78.6860 69.6055 30.5941 14.2348 11.1737 0.7238 19.1477 15.9336 30.5965 22.3533 5.8643 0.0139 7.8869 68.8055 0.8921 8.5475 6.1663 13.1475 13.2910 18.3912 28.5381 46.7850 1.1812 41.0694 13.8905 26.7484 329.1320 23.7332 10.9187 7.4281 7.9344 9.5144 50.2643 73.9811 4.6353 7.2737 55.7571 22.1482 5.5108 2.8147 1.4335 2.5929 34.5134 12.3671 1.0928 30.5860 1.5206 6.5022 10.7056 1.1817 24.0624 13.6731 0.0727 2.9306 1.8647 15.3254
temp: 298.150 k
press: 1.00000 atm
elementType: 8 8 8 8 7 6 6 6 6 6 6 6 6 6 6 6 6 6 6 6 1 1 1 1 1 1 1 1 1 1 1
symmnumber: 1
zpe: 595341.0 jmol-1
zpe.correction: 0.226753 hartree
zpe.thermalcorrener: 0.243083 hartree
zpe.thermalcorrenthalpy: 0.244028 hartree
zpe.thermalcorrgfe: 0.179319 hartree
zpe.sumelectzpe: -932.349807 hartree
zpe.sumelectthermal: -932.333477 hartree
zpe.sumelectthermalent: -932.332533 hartree
zpe.sumelectthermalfe: -932.397242 hartree
dipole: 3.4695 2.7713 -1.1082
dipole: 4.5766
quadrupole: -137.7742 -111.2982 -108.2127
quadrupole: -19.9292 9.0877 2.4882
quadrupole: -18.6792 7.7968 10.8823 -19.9292 9.0877 2.4882
hfenergy: -932.5765607 hartree
pointgroup: C01 [X(C15H11N1O4)]
dipole: -1.2541993 -1.0466315 -0.7574119 debye
polarizability: 264.2653916|5.4222517|156.489642|2.1467769|-15.1944721|152.8351123 unknown
InChI: InChI=1S/C15H11NO4/c17-15(10-5-7-12(8-6-10)16(18)19)14-9-11-3-1-2-4-13(11)20-14/h1-9,15,17H
charge 0 multiplicity 1
31 atoms
O  -1.425431 0.144978 -1.304691
O  -0.120425 -3.116767 -0.238452
O  5.398299 1.669776 0.482005
O  4.760516 1.079882 2.591178
N  4.603087 1.077373 1.30947
C  0.031965 -1.796031 -0.866331
C  -1.26719 -1.082851 -0.605269
C  1.236802 -1.035617 -0.297998
C  -3.299394 -0.263691 0.007423
C  -2.359258 -1.361763 0.186175
C  -2.690404 0.642199 -0.911252
C  2.140512 -0.373947 -1.163687
C  1.449037 -0.996551 1.104654
C  -4.58373 0.050441 0.519053
C  -3.278603 1.835905 -1.348114
C  3.247864 0.326921 -0.645235
C  2.550774 -0.306076 1.640631
C  3.43638 0.346882 0.752904
C  -5.199541 1.247581 0.09567
C  -4.558956 2.127984 -0.823007
H  0.167535 -1.895055 -1.966049
H  -2.47369 -2.250648 0.800789
H  1.974443 -0.399542 -2.246564
H  0.741746 -1.507912 1.765424
H  -5.086962 -0.617992 1.225246
H  -2.77409 2.501727 -2.053542
H  3.958456 0.848584 -1.291326
H  2.737387 -0.258857 2.716655
H  -6.191449 1.509779 0.479342
H  0.732578 -3.612201 -0.330758
H  -5.066356 3.04899 -1.129046
