program: Gaussian 09
title: 000199011
version: EM64L-G09RevD.01
frameworkgroup: C1[X(C16H23NO3)]
method: RPBEPBE
basis: SDD
operation: Freq
keyword: #p
keyword: freq=noraman
keyword: PBEPBE/SDD
title: #p freq=noraman PBEPBE/SDD
converged: YES YES NO NO
title: Mulliken charges:
elementType: O O O N C C C C C C C C C C C C C C C C H H H H H H H H H H H H H H H H H H H H H H H
charge: -0.200551 -0.306634 -0.301256 -0.078954 -0.146184 -0.369062 -0.366692 -0.509137 -0.359277 0.165441 -0.580441 -0.723524 0.551017 -0.548432 -0.423010 0.220531 -0.340079 0.174659 -0.530675 -0.530261 0.241444 0.214611 0.186278 0.192354 0.221840 0.232563 0.232171 0.197467 0.226612 0.213172 0.223338 0.205241 0.241987 0.221416 0.256746 0.237089 0.247846 0.229586 0.254527 0.221244 0.252853 0.222808 0.229332
chargesum: 0.00000
title: Mulliken charges with hydrogens summed into heavy atoms:
elementType: O O O N C C C C C C C C C C C C C C C C
charge: -0.200551 -0.306634 -0.301256 -0.078954 0.095260 0.031827 0.047502 -0.044403 0.064801 0.165441 -0.143932 -0.054880 0.551017 -0.291685 -0.185921 0.220531 -0.092233 0.174659 0.174681 0.174732
polarizability: 2.63910476e+02 3.53866341e-02 1.73296865e+02 5.71325964e+00 4.69029970e+00 1.37322655e+02
1716.lowfreq: -3.4416 0.0002 0.0004 0.0008 3.1445 5.6714 18.3817 20.1272 31.4916
frequency: 15.3887 19.6602 31.4759 49.8646 79.6861 86.2114 96.9952 109.9509 123.6678 150.9926 160.5323 162.8863 169.7910 177.0241 206.1503 234.3938 262.9495 274.0281 277.5965 303.3361 344.9000 349.8217 371.1599 394.9663 412.8093 429.4986 438.2984 485.3844 495.4385 540.5340 569.1269 574.2937 645.0179 692.3438 708.3822 716.6259 732.4679 748.1690 791.3419 801.4755 838.2747 869.8596 885.4700 896.4398 898.8926 945.9999 952.4461 954.8441 971.1345 979.7731 991.0044 1027.1646 1043.3323 1063.3489 1091.2283 1103.2534 1113.6347 1114.5273 1115.7468 1134.0906 1138.2715 1140.4892 1153.3660 1155.9914 1156.0990 1177.0413 1193.3140 1220.4827 1230.0234 1244.4467 1255.9183 1265.1501 1283.3589 1289.5583 1294.2212 1303.9949 1317.4080 1343.0668 1364.2393 1369.7717 1386.2311 1392.9209 1399.7626 1424.3459 1432.4152 1441.7080 1457.0887 1459.4194 1462.5808 1466.1939 1472.7635 1476.4652 1477.3364 1477.6368 1485.4053 1488.0139 1489.2418 1574.1956 1613.2183 1629.6890 2835.7255 2846.4612 2861.7317 2969.9693 2971.0109 2972.7531 2990.2717 2994.1929 2995.6283 3021.6017 3034.6044 3048.3964 3061.3555 3067.3546 3069.0614 3082.6438 3083.6300 3099.1408 3120.1369 3121.0376 3127.7040 3139.1794 3160.7260
redmass: 3.6374 4.5680 5.0425 4.7037 3.2652 3.4839 3.7057 3.0797 3.1982 2.4366 1.1269 1.4669 1.1309 1.5885 2.1106 4.5046 3.3607 4.1045 3.0098 2.9145 3.9656 3.5839 2.4082 4.6088 3.8007 3.8254 3.6944 3.2267 3.2726 4.6406 3.8345 4.6735 4.2866 3.1423 5.9440 3.0603 3.5315 3.4109 1.2284 2.3830 1.5551 1.9942 3.2889 1.6489 2.1320 5.5194 1.5908 1.5207 2.7293 3.5538 1.3704 1.9773 2.7386 2.7236 2.7288 2.5434 1.3689 1.2630 2.1489 1.9374 2.5227 1.4855 1.3315 1.3804 1.5027 1.3851 1.8183 1.6986 1.3728 2.1534 1.4297 1.7732 1.6693 1.1900 1.4371 1.5216 1.3772 1.4808 3.0238 2.1170 1.3763 1.2184 2.2641 1.1791 1.0918 1.3769 1.0539 1.0702 1.0845 1.0497 1.0652 1.0706 1.0966 1.0667 2.7497 1.0949 1.0581 7.2729 6.7854 9.5050 1.0713 1.0708 1.0704 1.0807 1.0308 1.0312 1.0365 1.0627 1.0606 1.0873 1.0882 1.0886 1.1022 1.1037 1.1035 1.0997 1.0994 1.0987 1.1027 1.1028 1.0889 1.0917 1.0957
irintensity: 0.0234 0.2507 0.3717 3.1045 3.8461 1.5276 3.2535 4.9750 2.5990 1.1415 0.6922 1.3852 0.2920 5.2718 4.1245 6.4718 7.6923 3.1218 0.8944 1.5000 0.4217 3.8576 4.4002 6.4200 1.3748 3.3749 2.9677 1.6344 8.1045 7.9556 7.5053 11.2088 10.9827 5.7282 9.2944 10.7317 2.3211 6.6749 0.5234 0.8383 36.7198 14.4240 10.5800 16.3976 12.7644 55.1454 0.9342 9.2688 14.9510 44.3099 3.4593 3.9355 11.1456 66.1005 61.6923 12.6608 24.5626 1.5904 5.0971 3.9937 55.0856 6.9933 0.5644 5.5734 6.6644 37.4215 48.9652 23.1975 9.6974 86.0979 7.9488 39.1142 20.7210 8.6608 7.4818 11.9223 7.5593 41.3394 11.7295 1.3125 0.7526 23.4850 15.9738 0.9718 16.7807 15.7095 16.9550 6.3646 3.0391 8.9170 3.8315 8.7213 4.4341 10.2952 130.8837 12.1580 31.3476 9.0374 7.5047 180.8893 52.6749 45.4866 153.1487 13.4247 93.5638 56.2198 26.0834 13.8694 26.0865 10.9568 42.7517 26.0285 28.8933 32.5622 23.3740 8.0308 45.5056 23.6552 25.7032 24.0514 11.8691 7.3098 8.0402
temp: 298.150 k
press: 1.00000 atm
elementType: 8 8 8 7 6 6 6 6 6 6 6 6 6 6 6 6 6 6 6 6 1 1 1 1 1 1 1 1 1 1 1 1 1 1 1 1 1 1 1 1 1 1 1
symmnumber: 1
zpe: 946857.8 jmol-1
zpe.correction: 0.360639 hartree
zpe.thermalcorrener: 0.381869 hartree
zpe.thermalcorrenthalpy: 0.382814 hartree
zpe.thermalcorrgfe: 0.308155 hartree
zpe.sumelectzpe: -902.335341 hartree
zpe.sumelectthermal: -902.314111 hartree
zpe.sumelectthermalent: -902.313166 hartree
zpe.sumelectthermalfe: -902.387825 hartree
dipole: 3.3471 -0.4508 -0.3035
dipole: 3.3909
quadrupole: -142.6034 -117.2441 -117.1757
quadrupole: 8.7382 5.9305 2.2267
quadrupole: -16.9290 8.4303 8.4987 8.7382 5.9305 2.2267
hfenergy: -902.69598 hartree
pointgroup: C01 [X(C16H23N1O3)]
dipole: 1.3197782 -0.1823042 -0.0688622 debye
polarizability: 263.6223062|1.4303463|173.9129849|8.1614174|-0.1271669|136.9947051 unknown
InChI: InChI=1S/C16H23NO3/c1-12-11-17(9-7-14(12)18)8-6-13-4-5-15(19-2)16(10-13)20-3/h4-5,10,12H,6-9,11H2,1-3H3
charge 0 multiplicity 1
43 atoms
O  -6.52732 0.407964 0.520394
O  4.020945 1.903525 0.173215
O  5.423571 -0.660466 0.421342
N  -2.53161 -0.52584 0.163609
C  -4.580118 0.382816 -0.98016
C  -3.115389 0.650951 -0.522177
C  -3.293168 -0.847745 1.394365
C  -4.762247 -1.199672 1.049162
C  -1.074618 -0.402559 0.419672
C  -5.408638 -0.089866 0.222879
C  -0.218802 -0.485324 -0.873005
C  -5.19893 1.600011 -1.687023
C  1.26848 -0.51747 -0.55385
C  1.991296 0.68305 -0.343123
C  1.953014 -1.751113 -0.402504
C  3.36012 0.663475 -0.003053
C  3.328474 -1.781372 -0.086164
C  4.046909 -0.580948 0.09816
C  4.578484 2.117535 1.529334
C  6.326109 -0.059451 -0.588823
H  -4.529057 -0.47983 -1.678271
H  -2.512166 0.888205 -1.415403
H  -3.10536 1.559106 0.136986
H  -3.283611 0.003655 2.123075
H  -2.814884 -1.711565 1.890699
H  -5.356618 -1.366219 1.963851
H  -4.762541 -2.130546 0.448683
H  -0.822672 0.542744 0.965176
H  -0.7795 -1.239077 1.080953
H  -0.44131 0.379812 -1.525335
H  -0.521662 -1.396897 -1.420101
H  -4.610435 1.873868 -2.581822
H  -6.235262 1.387243 -1.998224
H  -5.236793 2.472705 -1.010744
H  1.502303 1.65966 -0.43601
H  1.411091 -2.692399 -0.552771
H  3.872365 -2.726965 0.007994
H  5.082409 3.095176 1.487522
H  5.296341 1.320307 1.793768
H  3.760911 2.146855 2.274612
H  6.089067 1.008181 -0.747301
H  6.24134 -0.607284 -1.546514
H  7.341486 -0.174234 -0.179672
