program: Gaussian 09
title: 000199014
version: EM64L-G09RevD.01
frameworkgroup: C1[X(C19H20N2O3)]
method: RPBEPBE
basis: SDD
operation: Freq
keyword: #p
keyword: freq=noraman
keyword: PBEPBE/SDD
title: #p freq=noraman PBEPBE/SDD
converged: YES YES NO NO
title: Mulliken charges:
elementType: O O O N N C C C C C C C C C C C C C C C C C C C H H H H H H H H H H H H H H H H H H H H
charge: -0.377435 -0.250771 -0.422026 -0.229099 -0.284144 0.134248 -0.478771 -0.364556 0.082646 0.065383 -0.347440 0.372036 0.440155 -0.698420 -0.320532 -0.419594 -0.372165 -0.356290 -0.318164 -0.360894 -0.218671 -0.211532 0.284134 -0.255085 0.218245 0.216078 0.230053 0.195919 0.192915 0.200076 0.213687 0.208175 0.214658 0.273236 0.290530 0.289587 0.250747 0.380780 0.261934 0.231484 0.227007 0.223574 0.227965 0.360339
chargesum: 0.00000
title: Mulliken charges with hydrogens summed into heavy atoms:
elementType: O O O N N C C C C C C C C C C C C C C C C C C C
charge: 0.003344 -0.250771 -0.061687 -0.229099 -0.284144 0.134248 -0.044449 0.061417 0.082646 0.065383 0.045550 0.372036 0.440155 -0.061900 -0.047295 -0.129064 -0.082577 -0.105544 -0.056230 -0.129410 0.008336 0.012043 0.284134 -0.027121
polarizability: 2.94104066e+02 1.62177189e+01 2.50828507e+02 1.15746507e+00 2.44310913e+01 1.72698237e+02
1716.lowfreq: -0.0005 -0.0004 0.0006 3.3691 4.7052 5.6667 15.4070 29.6666 36.8026
frequency: 14.7827 29.6399 36.7995 45.6597 53.0060 59.2708 68.3783 83.0763 102.3439 118.4865 144.8974 166.0558 195.6792 214.3234 225.1868 239.4223 248.4671 266.9704 290.6606 319.7656 341.3471 350.1741 367.2013 371.9895 389.0053 408.3090 419.5482 427.6284 430.5436 495.6644 501.5354 522.3928 580.3882 595.8708 610.2472 617.3297 637.7093 650.9019 673.5829 692.8568 710.8721 729.5871 737.2608 757.8955 786.8713 792.2937 810.4318 829.3897 834.4957 840.9196 849.9297 896.3930 903.0200 918.7148 935.6047 966.8588 969.2233 985.1069 988.4877 997.1476 1008.5523 1018.3762 1032.7089 1065.2674 1067.7852 1072.0629 1095.0719 1106.2567 1108.1311 1112.1811 1141.2348 1170.8099 1172.3556 1188.4716 1194.8245 1227.0280 1233.7194 1249.1935 1260.1401 1285.5804 1293.5137 1297.4587 1301.1887 1310.8829 1326.2696 1330.1057 1350.3705 1368.5322 1383.7955 1385.7243 1390.6235 1430.9242 1444.9120 1455.8408 1467.0540 1475.7498 1476.3338 1484.4172 1486.9493 1496.6333 1588.5733 1590.5741 1608.9514 1622.2825 1632.6458 1687.4940 2961.8905 2970.9462 2973.6464 2985.1989 3005.6593 3030.6690 3056.0501 3069.1961 3070.5039 3122.5413 3128.6520 3139.8737 3145.3863 3159.4871 3160.2928 3173.3408 3180.0953 3192.2548 3461.8643 3583.4847
redmass: 3.6606 4.7219 5.9592 4.0991 3.7171 1.7407 6.7266 4.4844 2.5542 4.0652 7.0248 4.8807 3.9808 1.9745 2.4901 1.8724 5.4796 5.9003 5.9430 5.2044 1.8301 2.9440 1.8159 1.6516 4.9339 2.9089 2.9219 4.0314 4.4300 5.0208 3.4140 3.0449 8.2988 7.6742 7.4197 7.1549 6.8960 6.5415 3.3331 2.0806 3.5401 1.5626 2.5390 1.6929 1.4722 4.8604 1.3888 2.8459 1.3971 1.9963 4.1407 1.7796 1.4247 1.3551 1.2877 1.3743 1.3457 3.7351 1.4981 3.0865 4.2879 3.0854 2.1545 2.9471 2.5878 2.5636 1.5221 1.9205 2.0615 2.1444 1.3436 1.1101 1.0493 1.1236 1.9911 2.2849 1.6111 2.1272 1.4234 1.3258 1.3367 1.9198 1.9071 1.8972 1.4856 1.6494 1.6042 6.0850 7.7372 1.2189 6.5221 3.4168 2.3939 1.1105 1.0667 1.0452 1.0686 2.4100 1.0808 2.7281 6.5543 6.7746 6.1606 6.4987 10.7111 7.9372 1.0584 1.0396 1.0576 1.0606 1.0982 1.1009 1.1033 1.1001 1.1004 1.0880 1.0851 1.0902 1.0966 1.0956 1.0889 1.0965 1.0974 1.0957 1.0651 1.0662
irintensity: 0.3956 0.1222 1.2474 1.0214 0.4749 0.1725 2.4245 0.5168 0.0773 1.1663 3.0135 0.5017 0.0673 2.2241 2.5107 4.7730 3.9726 1.2470 6.5577 8.2258 53.4022 19.1300 35.1437 118.5344 19.9059 0.8973 15.7720 6.1227 2.0659 15.6703 17.2538 27.1071 21.2840 19.0690 3.3487 3.2247 2.3488 11.6264 7.3948 34.7833 13.6116 4.5440 15.6590 68.4176 3.4571 19.1153 36.4243 12.6801 6.9029 46.6502 10.2834 9.1348 4.9093 10.5084 6.6534 1.1726 0.3268 0.4407 0.5334 2.2662 6.3704 2.6753 18.5569 47.6579 33.0225 2.5738 99.0398 60.4068 0.6531 20.0012 245.8662 3.0799 0.1750 4.0219 13.8908 92.9329 3.4973 66.0041 8.3965 1.7967 4.3701 48.4561 37.4475 143.2758 56.8079 29.3360 9.3831 166.0999 2.3320 12.1798 28.8111 12.2981 18.2252 2.3321 0.2367 11.4020 4.6345 121.2427 14.9652 223.1698 10.0865 6.1549 74.6382 3.3596 417.3287 85.6401 26.6008 27.5331 19.8222 69.9120 7.3086 3.5231 10.3568 75.1840 78.7222 18.3867 0.9107 17.2368 3.0768 38.6090 2.2823 7.6086 1.4840 2.0406 105.4683 62.3944
temp: 298.150 k
press: 1.00000 atm
elementType: 8 8 8 7 7 6 6 6 6 6 6 6 6 6 6 6 6 6 6 6 6 6 6 6 1 1 1 1 1 1 1 1 1 1 1 1 1 1 1 1 1 1 1 1
symmnumber: 1
zpe: 917034.4 jmol-1
zpe.correction: 0.349280 hartree
zpe.thermalcorrener: 0.372059 hartree
zpe.thermalcorrenthalpy: 0.373003 hartree
zpe.thermalcorrgfe: 0.294904 hartree
zpe.sumelectzpe: -1069.433689 hartree
zpe.sumelectthermal: -1069.410910 hartree
zpe.sumelectthermalent: -1069.409966 hartree
zpe.sumelectthermalfe: -1069.488066 hartree
dipole: -5.2135 -4.8713 -1.2350
dipole: 7.2412
quadrupole: -132.5511 -133.9067 -139.2510
quadrupole: 5.0652 8.7293 9.2114
quadrupole: 2.6851 1.3296 -4.0148 5.0652 8.7293 9.2114
hfenergy: -1069.7829692 hartree
pointgroup: C01 [X(C19H20N2O3)]
dipole: 1.8338977 -2.0653802 0.6980839 debye
polarizability: 290.2203504|-20.2362247|249.2907242|1.219125|-31.913542|178.1197367 unknown
InChI: InChI=1S/C19H20N2O3/c1-2-3-9-17-18(23)20(14-7-5-4-6-8-14)21(19(17)24)15-10-12-16(22)13-11-15/h4-8,10-13,22,24H,2-3,9H2,1H3
charge 0 multiplicity 1
44 atoms
O  -1.379477 -2.000368 1.697701
O  -1.92121 2.308036 -0.444239
O  3.963626 -4.169064 -0.867148
N  0.13328 -0.332284 0.78025
N  -0.04241 0.886518 0.040471
C  -2.14331 0.134726 0.719564
C  -3.633402 0.072257 0.912701
C  -4.403947 -0.208718 -0.406886
C  -1.182384 -0.773462 1.101941
C  -1.457726 1.235558 0.042245
C  -5.935421 -0.209996 -0.205225
C  1.134657 -1.284212 0.348756
C  1.050907 1.796118 -0.104234
C  -6.707806 -0.504007 -1.50951
C  1.487519 -1.434091 -1.017065
C  1.755153 -2.088495 1.335901
C  0.953607 2.823107 -1.080633
C  2.21513 1.687607 0.699879
C  2.440499 -2.395449 -1.39149
C  2.692978 -3.075433 0.957306
C  2.020107 3.732236 -1.238533
C  3.27939 2.595495 0.515357
C  3.033811 -3.22646 -0.408141
C  3.19076 3.6223 -0.452127
H  -3.878298 -0.707258 1.658223
H  -3.982716 1.042037 1.319678
H  -4.128072 0.562271 -1.152118
H  -4.08138 -1.18675 -0.817582
H  -6.204258 -0.963376 0.563854
H  -6.248571 0.774405 0.19848
H  -7.801204 -0.495672 -1.34489
H  -6.433894 -1.495894 -1.916299
H  -6.476087 0.251259 -2.283921
H  1.019547 -0.79229 -1.769345
H  1.551161 -1.901856 2.396575
H  0.043631 2.912861 -1.677252
H  2.279568 0.913037 1.468643
H  -0.552733 -2.554811 1.67114
H  2.734491 -2.526175 -2.436764
H  3.169296 -3.697436 1.725332
H  1.93461 4.528187 -1.986574
H  4.175897 2.504183 1.138919
H  4.017952 4.327119 -0.588222
H  4.33933 -4.700163 -0.121821
