program: Gaussian 09
title: 000198979
version: EM64L-G09RevD.01
frameworkgroup: C1[X(C7H12Cl2N2)]
method: RPBEPBE
basis: SDD
operation: Freq
keyword: #p
keyword: freq=noraman
keyword: PBEPBE/SDD
title: #p freq=noraman PBEPBE/SDD
converged: YES YES NO NO
title: Mulliken charges:
elementType: Cl Cl N N C C C C C C C H H H H H H H H H H H H
charge: -0.063191 -0.063466 -0.110788 -0.009006 -0.383621 -0.341733 -0.340824 -0.410013 -0.571922 -0.566241 -0.149823 0.235703 0.239875 0.235657 0.243372 0.240157 0.240306 0.259744 0.251755 0.267567 0.266344 0.267093 0.263056
chargesum: 0.00000
title: Mulliken charges with hydrogens summed into heavy atoms:
elementType: Cl Cl N N C C C C C C C
charge: -0.063191 -0.063466 -0.110788 -0.009006 0.091957 0.137296 0.139638 0.101487 -0.038011 -0.036092 -0.149823
polarizability: 1.23186773e+02 -5.89172398e-01 1.24596621e+02 -8.18585571e-02 7.11817550e-01 7.44061838e+01
1716.lowfreq: -7.5166 -0.0027 -0.0025 -0.0023 1.8512 8.1199 27.0855 28.9652 33.2369
frequency: 26.9605 28.9104 33.1914 63.8515 79.1616 95.0735 132.7562 150.7450 195.7967 206.4443 274.0300 300.8160 360.3453 377.2249 426.9385 471.6809 529.0062 668.2474 670.2308 763.4569 773.0676 777.2777 835.2590 937.6945 994.5651 1000.8639 1019.5524 1026.4947 1061.0242 1065.2835 1100.1545 1118.5770 1167.7505 1233.9675 1236.5257 1252.0300 1258.1344 1275.7643 1286.9281 1313.8370 1316.9252 1363.0557 1365.6438 1377.4239 1444.5343 1451.1126 1452.5773 1475.7933 1477.3025 1479.1831 2198.6544 2931.2215 2952.9753 2957.1853 3000.4064 3043.8569 3049.3762 3053.2110 3057.7340 3057.9424 3068.4997 3143.7422 3144.8296
redmass: 5.7405 6.7684 8.8521 2.8473 2.3849 2.6212 3.0974 4.2172 4.4766 8.2193 3.6297 3.8264 4.0634 3.9366 3.7763 3.1962 4.9502 6.2907 5.9424 1.1721 1.1569 1.1434 4.8412 4.5458 1.7943 1.5054 2.2043 2.5214 3.3809 3.4204 1.5967 1.5501 1.2441 1.4113 1.4289 1.2431 1.3421 1.2705 1.1370 1.3468 1.3519 1.3553 1.3246 1.2951 1.0842 1.0891 1.0927 1.0818 1.0894 1.0818 12.4305 1.0685 1.0664 1.0669 1.0593 1.0932 1.0951 1.0848 1.0596 1.0665 1.1009 1.1120 1.1122
irintensity: 2.9483 0.8112 2.0554 5.7309 2.8704 1.5788 2.4770 2.8056 8.1749 4.5780 0.3092 0.5188 13.0961 5.0113 5.9450 3.0224 8.1450 69.2442 104.5496 2.3908 5.1652 8.7772 8.4958 3.9876 4.1184 6.8407 13.0972 8.8834 0.9747 10.9672 59.6392 40.2195 7.6110 17.5576 20.7129 12.9782 15.0947 1.3065 1.0703 28.3525 16.5150 2.6696 9.4598 6.0235 9.8326 1.5773 8.0373 12.2070 11.1809 11.1269 12.8733 46.0786 23.6645 59.6782 9.1118 1.0929 12.2596 11.7683 26.6311 21.1708 24.8502 13.6822 23.9180
temp: 298.150 k
press: 1.00000 atm
elementType: 17 17 7 7 6 6 6 6 6 6 6 1 1 1 1 1 1 1 1 1 1 1 1
symmnumber: 1
zpe: 481214.6 jmol-1
zpe.correction: 0.183285 hartree
zpe.thermalcorrener: 0.196856 hartree
zpe.thermalcorrenthalpy: 0.197800 hartree
zpe.thermalcorrgfe: 0.138907 hartree
zpe.sumelectzpe: -1302.656688 hartree
zpe.sumelectthermal: -1302.643117 hartree
zpe.sumelectthermalent: -1302.642173 hartree
zpe.sumelectthermalfe: -1302.701066 hartree
dipole: 0.3597 -1.5450 -0.0735
dipole: 1.5880
quadrupole: -98.6607 -112.3999 -77.4839
quadrupole: 4.8835 0.4582 -0.8914
quadrupole: -2.4792 -16.2184 18.6976 4.8835 0.4582 -0.8914
hfenergy: -1302.8399733 hartree
pointgroup: C01 [X(C7H12Cl2N2)]
dipole: 0.6222826 0.0434025 0.0349581 debye
dipolederiv: -0.3419087 -0.2532128 -0.036398 -0.2943639 -0.6353973 -0.043319 0.014886 0.0392829 -0.1879226 -0.3288167 0.287792 -0.0087824 0.2506341 -0.654739 0.0347676 0.0380831 -0.0534695 -0.190596 -0.9116968 0.0268476 -0.0276379 -0.0396102 -0.9678936 -0.0026939 -0.0442302 -0.0078648 -0.4790738 -0.3587249 0.0223139 0.0358664 -0.0384824 -0.2226321 0.0061434 -0.0569077 0.0080755 -0.218578 0.8996375 -0.0694194 0.039824 -0.1199676 0.0843907 -0.0528627 -0.191101 -0.0638865 0.3374928 0.2313969 0.3222795 -0.0897604 0.2035194 0.4513453 -0.0439291 0.0386218 0.2293735 0.2595217 0.1602159 -0.2123557 0.0063112 -0.2653756 0.5428135 0.1067856 0.1391952 -0.1560796 0.2481772 -0.1315239 0.0212598 0.0134571 0.0819481 0.2033668 -0.0355408 0.1022774 -0.0596145 0.0963364 0.3564654 0.2892158 -0.0079169 0.3448342 0.7920233 0.0051203 -0.0974165 -0.1136225 0.1056878 0.4053324 -0.369019 -0.0135153 -0.3113586 0.7455597 0.0266422 -0.0734281 0.1788416 0.1102759 0.230353 0.011917 0.0301247 0.0919171 -0.070068 -0.0148095 0.1635739 -0.0188653 -0.0797658 -0.0915629 0.0377778 -0.0411938 0.0978998 0.0300591 0.1060779 -0.0727355 0.0669085 -0.136472 0.0370667 -0.0437677 0.0101774 -0.0409387 -0.1155549 -0.0371323 0.0183259 -0.0177807 0.0677559 -0.0492972 0.0817194 -0.044797 0.101298 -0.0424978 0.0191779 -0.0450114 -0.0039655 0.0727553 -0.0420473 -0.0893011 0.1169347 -0.0216708 0.0099069 -0.0229026 0.0946364 0.0186775 -0.1069984 -0.1064874 -0.0413645 0.0538745 -0.0459985 0.0264452 0.0343323 0.0255748 0.0406682 0.0663822 0.0598206 -0.0213477 -0.089973 0.0172565 -0.0786516 -0.092308 -0.052525 -0.0905411 -0.0950858 0.0466605 0.0127 -0.0381856 0.0043729 0.0709279 0.0798211 -0.0240929 0.0541852 -0.0163121 0.048365 -0.0350006 -0.0181168 -0.0483501 -0.0580665 -0.0361914 -0.018805 -0.0024192 0.0999872 0.0124178 -0.0237784 0.1120598 -0.041284 0.0002638 0.0161573 0.0674227 -0.0136912 -0.0470624 -0.0358255 0.0373065 -0.0292936 0.0628238 -0.0856465 0.0515737 -0.0141915 0.0143977 0.0698699 0.0211933 0.0252934 -0.0490506 0.0028642 -0.0213828 -0.1063005 -0.0487349 -0.0530407 -0.0378343 -0.1110339 -0.0178557 0.0759912 0.0080322 -0.0045718 0.0013907 0.0365824 0.0044304 0.0614588 unknown
polarizability: 124.7910896|-0.1139191|122.9498279|1.1165503|1.1622596|74.4486608 unknown
InChI: InChI=1S/C7H12Cl2N2/c8-2-6-11(7-3-9)5-1-4-10/h1-3,5-7H2
charge 0 multiplicity 1
23 atoms
Cl 2.652639 3.387147 0.31752
Cl 2.320168 -3.682287 0.178624
N  0.398533 -0.037585 -0.319604
N  -4.501717 0.235762 0.151429
C  -1.047501 -0.157996 -0.567328
C  1.009521 1.284457 -0.562488
C  1.227168 -1.221481 -0.625837
C  -1.883254 0.434021 0.60975
C  1.846044 1.707893 0.655248
C  1.287092 -2.151246 0.596696
C  -3.332464 0.333581 0.369377
H  -1.352255 0.344083 -1.512445
H  -1.30178 -1.22745 -0.675267
H  0.214162 2.03337 -0.730491
H  1.650258 1.288676 -1.470135
H  2.252078 -0.896006 -0.880648
H  0.842328 -1.785664 -1.501747
H  -1.624347 -0.100013 1.542531
H  -1.620256 1.498269 0.760933
H  1.228204 1.837652 1.555755
H  2.678906 1.016509 0.854038
H  1.77992 -1.671683 1.455026
H  0.296252 -2.534508 0.88456
