program: Gaussian 09
title: 000199051
version: EM64L-G09RevD.01
frameworkgroup: C1[X(C24H19ClN2O3)]
method: RPBEPBE
basis: SDD
operation: Freq
keyword: #p
keyword: freq=noraman
keyword: PBEPBE/SDD
title: #p freq=noraman PBEPBE/SDD
converged: YES YES NO NO
title: Mulliken charges:
elementType: Cl O O O N N C C C C C C C C C C C C C C C C C C C C C C C C H H H H H H H H H H H H H H H H H H H
charge: -0.040618 -0.204202 -0.201371 -0.211170 -0.238981 -0.249743 -0.339867 -0.400775 0.113082 0.105981 -0.530394 0.458390 0.460581 0.127233 -0.373594 -0.379342 -0.357662 -0.352825 0.295820 -0.211686 -0.212381 -0.208043 -0.204941 -0.248234 -0.248122 -0.326559 -0.333220 -0.225700 -0.217989 -0.100868 0.294752 0.259058 0.253197 0.260213 0.246405 0.279953 0.280268 0.265184 0.264878 0.232993 0.232181 0.231725 0.231649 0.234036 0.233467 0.252193 0.283988 0.259070 0.261986
chargesum: 0.00000
title: Mulliken charges with hydrogens summed into heavy atoms:
elementType: Cl O O O N N C C C C C C C C C C C C C C C C C C C C C C C C
charge: -0.040618 -0.204202 -0.201371 -0.211170 -0.238981 -0.249743 -0.045115 0.111480 0.113082 0.105981 -0.023775 0.458390 0.460581 0.127233 -0.093640 -0.099075 -0.092478 -0.087947 0.295820 0.021308 0.019800 0.023683 0.026708 -0.014198 -0.014655 -0.074366 -0.049232 0.033370 0.043997 -0.100868
polarizability: 3.14089401e+02 -8.68649532e+00 3.01143090e+02 -5.33233793e+00 1.48553555e+01 2.52250170e+02
1716.lowfreq: -7.3512 -3.7617 -0.0013 0.0012 0.0016 2.6187 9.4622 12.2478 23.5060
frequency: 9.3737 12.1681 23.4477 35.8031 50.0026 52.2299 58.7574 60.8904 73.6345 81.1663 82.5858 117.7173 123.8292 129.4750 204.7062 205.4830 211.5782 245.0013 254.2092 263.1072 265.1955 289.9300 303.6360 331.4257 368.9419 384.6698 403.7891 406.6887 407.0077 409.5684 442.7573 458.7588 473.5806 502.0230 505.0299 512.6259 563.9225 568.7451 587.9921 611.5100 613.4239 622.0569 633.9549 649.7442 679.5431 688.3922 694.0503 697.1421 717.7891 752.0439 758.7447 764.6542 789.6353 819.0165 829.7274 837.3917 838.4694 849.3614 853.3750 866.5039 910.9080 912.7187 933.7980 962.5007 970.0708 972.0245 972.6236 986.8780 987.8762 993.3334 993.4574 994.7259 998.6088 1019.6827 1024.7304 1033.2643 1046.0061 1071.2557 1072.0667 1087.2989 1094.2207 1110.3626 1122.4138 1138.3627 1173.4028 1175.0100 1175.5042 1179.7368 1185.8832 1190.4272 1190.7619 1212.0823 1231.7641 1236.0825 1286.3310 1287.3566 1294.5331 1301.6348 1312.1269 1322.9380 1336.7814 1360.8646 1373.3940 1382.8596 1385.4498 1398.5103 1436.2771 1442.9725 1447.9005 1451.6864 1474.9725 1479.1308 1482.4356 1564.6262 1590.0671 1591.6193 1593.8950 1603.8763 1605.5774 1608.0723 1634.5610 1664.7884 2963.5399 3006.1071 3015.8445 3032.6860 3095.8224 3133.9256 3134.0581 3144.8866 3145.1123 3150.8917 3154.6072 3161.0780 3161.4702 3172.3632 3172.5429 3172.8318 3176.2452 3190.8666 3191.2982
redmass: 7.2864 8.0254 4.8531 5.7547 4.8477 5.8864 6.4686 3.9711 6.4985 7.2018 8.5225 2.6553 8.8660 4.2237 4.1874 3.9775 5.2605 5.6363 5.8426 7.4276 4.9310 7.8561 6.8904 7.8857 6.7887 8.7626 3.5071 2.9432 2.8926 4.9007 6.0780 3.2833 5.5710 3.4625 4.8327 5.0242 8.0734 2.2419 5.3360 6.4424 6.2384 7.1398 7.2695 7.0915 3.1349 4.7472 2.5063 2.0054 3.5201 3.0357 1.7085 2.1021 1.8384 5.1558 1.3779 1.2575 1.2606 1.4388 7.2444 4.4588 1.4461 1.3901 2.9060 1.4123 1.7876 1.4804 2.4072 5.9811 5.4270 1.3439 1.3331 1.3128 4.0016 2.9484 2.3257 2.1175 2.0913 2.5648 2.6093 1.6948 2.3933 1.3888 3.1795 2.4661 1.2551 1.0519 1.1015 1.4024 1.2181 1.1209 1.1404 3.1861 1.6072 3.3574 3.3487 4.0712 1.2827 1.3386 1.5370 1.3371 1.5323 1.7622 4.4181 8.6721 10.3696 3.9938 1.1136 2.3075 2.3537 1.0977 2.3264 2.2863 2.2892 7.7254 6.6173 6.3997 6.5991 6.1381 7.8002 6.0060 12.0553 11.9209 1.0599 1.0803 1.0981 1.0617 1.1038 1.0854 1.0854 1.0900 1.0899 1.0885 1.0888 1.0946 1.0945 1.0985 1.0983 1.0964 1.0976 1.0962 1.0963
irintensity: 0.3008 0.1569 0.3245 0.3952 1.0117 0.6920 1.1597 0.4349 0.4861 1.8447 3.3515 1.1767 5.0210 0.2979 7.8989 2.8318 0.8469 8.4344 0.9291 5.8622 0.7651 6.9057 2.5187 4.3395 0.3258 3.4023 4.6643 0.5375 0.1754 2.2081 20.5776 11.7923 20.4482 4.9320 4.7257 27.1861 17.2041 7.6797 1.6253 1.2407 0.1990 0.7824 8.1227 0.3687 4.2292 10.0543 8.7545 68.2507 4.2344 40.7927 74.6294 28.9999 35.1607 24.7432 7.8495 0.8295 1.9389 32.9474 0.2442 14.2031 3.9095 3.7538 6.4751 1.5747 13.7821 4.0175 28.6268 0.3619 0.7695 0.6047 0.3722 0.1869 32.0786 4.2615 11.3278 26.6337 2.1025 40.2424 22.7919 11.6984 12.2937 10.9123 29.5607 9.6644 6.9702 0.1641 2.1195 35.7031 2.8100 2.6550 1.2320 139.1026 7.5581 125.0713 109.1232 258.4861 4.4866 22.7659 125.7174 1.1295 2.2742 15.1419 30.4184 2.6715 0.5757 27.8063 8.3604 8.7464 14.8452 42.2063 16.3171 56.5384 94.7952 97.9891 126.9923 3.7190 7.4902 8.9515 58.9438 49.8749 298.6111 211.5447 18.7201 5.1087 5.2823 9.3699 5.5325 0.3283 0.2532 13.6193 10.4344 6.3657 0.2457 35.8901 20.5087 7.8832 9.9832 5.8225 1.4338 1.0273 0.9290
temp: 298.150 k
press: 1.00000 atm
elementType: 17 8 8 8 7 7 6 6 6 6 6 6 6 6 6 6 6 6 6 6 6 6 6 6 6 6 6 6 6 6 1 1 1 1 1 1 1 1 1 1 1 1 1 1 1 1 1 1 1
symmnumber: 1
zpe: 971961.3 jmol-1
zpe.correction: 0.370201 hartree
zpe.thermalcorrener: 0.396278 hartree
zpe.thermalcorrenthalpy: 0.397222 hartree
zpe.thermalcorrgfe: 0.309127 hartree
zpe.sumelectzpe: -1719.091920 hartree
zpe.sumelectthermal: -1719.065843 hartree
zpe.sumelectthermalent: -1719.064899 hartree
zpe.sumelectthermalfe: -1719.152994 hartree
dipole: -3.0575 4.0831 1.5952
dipole: 5.3446
quadrupole: -172.3718 -185.4886 -182.9999
quadrupole: -7.1715 0.2714 0.4979
quadrupole: 7.9150 -5.2018 -2.7131 -7.1715 0.2714 0.4979
hfenergy: -1719.462121 hartree
pointgroup: C01 [X(C24H19Cl1N2O3)]
dipole: 1.3029387 -1.4467735 0.7941907 debye
polarizability: 315.246699|-8.7054036|294.5229316|3.1988066|-21.2876092|257.7130299 unknown
InChI: InChI=1S/C24H19ClN2O3/c25-18-13-11-17(12-14-18)22(28)16-15-21-23(29)26(19-7-3-1-4-8-19)27(24(21)30)20-9-5-2-6-10-20/h1-14,21H,15-16H2
charge 0 multiplicity 1
49 atoms
Cl -7.038727 -2.023543 2.422869
O  0.538139 -0.005099 -3.151374
O  1.31286 3.073959 0.51539
O  -3.640595 2.616553 -1.273738
N  1.785688 -0.043269 -1.134258
N  2.008891 0.873231 -0.035127
C  0.626923 1.975369 -1.625056
C  -0.898186 2.257804 -1.615059
C  0.965595 0.567725 -2.118344
C  1.304613 2.084895 -0.258137
C  -1.690338 1.243966 -0.770022
C  1.873087 -1.465173 -0.921468
C  3.178914 0.744206 0.794797
C  -3.18258 1.585102 -0.700179
C  2.09903 -2.3060 -2.039652
C  3.158646 1.314264 2.092431
C  1.70252 -2.018305 0.372939
C  4.338893 0.085747 0.315263
C  -4.094124 0.673019 0.07234
C  2.141509 -3.704379 -1.854433
C  4.311716 1.228504 2.901816
C  1.76458 -3.417545 0.542223
C  5.47684 -0.004201 1.143952
C  1.980256 -4.267242 -0.567395
C  5.471643 0.566605 2.437735
C  -3.636253 -0.514782 0.704083
C  -5.469515 1.019562 0.171586
C  -4.527498 -1.340512 1.420626
C  -6.371868 0.207631 0.883827
C  -5.883223 -0.964106 1.499597
H  1.104348 2.726281 -2.285232
H  -1.059394 3.278669 -1.22792
H  -1.265493 2.241195 -2.655468
H  -1.578211 0.222891 -1.18792
H  -1.295503 1.205258 0.266791
H  2.218503 -1.870011 -3.0337
H  2.265084 1.833019 2.445838
H  1.531177 -1.365877 1.233827
H  4.352618 -0.346066 -0.689358
H  2.307881 -4.353198 -2.72098
H  4.297688 1.677757 3.900622
H  1.641284 -3.842487 1.544334
H  6.370862 -0.516747 0.7727
H  2.025008 -5.352779 -0.430062
H  6.359477 0.496059 3.074941
H  -2.584555 -0.811178 0.640353
H  -5.808824 1.936595 -0.320938
H  -4.17917 -2.256869 1.905319
H  -7.429717 0.473902 0.961621
