program: Gaussian 09
title: 000198988
version: EM64L-G09RevD.01
frameworkgroup: C1[X(C17H20N4O2)]
method: RPBEPBE
basis: SDD
operation: Freq
keyword: #p
keyword: freq=noraman
keyword: PBEPBE/SDD
title: #p freq=noraman PBEPBE/SDD
converged: YES YES NO NO
title: Mulliken charges:
elementType: O O N N N N C C C C C C C C C C C C C C C C C H H H H H H H H H H H H H H H H H H H H
charge: -0.269967 -0.266242 -0.099010 -0.125168 -0.117559 -0.078691 -0.347926 -0.351833 -0.401725 -0.389468 -0.494066 0.507492 0.055352 -0.486245 -0.457783 0.204441 0.157242 -0.326426 0.237997 -0.202276 -0.282284 -0.321831 -0.775890 0.197240 0.230430 0.211120 0.188569 0.263034 0.217840 0.213947 0.264341 0.220638 0.197778 0.288254 0.237175 0.248973 0.235433 0.235423 0.237487 0.234006 0.231467 0.229206 0.249503
chargesum: 0.00000
title: Mulliken charges with hydrogens summed into heavy atoms:
elementType: O O N N N N C C C C C C C C C C C C C C C C C
charge: -0.269967 -0.266242 -0.099010 -0.125168 -0.117559 -0.078691 0.079744 0.047857 0.079149 0.088820 -0.075650 0.507492 0.055352 -0.197990 -0.220608 0.204441 0.157242 -0.077453 0.237997 0.268581 -0.044797 -0.087824 -0.065714
polarizability: 3.15800794e+02 1.55238464e+01 1.88050374e+02 -1.07510083e+01 1.46771660e-02 1.68577026e+02
1716.lowfreq: -57.4654 -45.2933 -8.3096 -3.9920 -0.0011 -0.0009 -0.0006 6.6270 17.0383
frequency: -57.4607 -45.2836 16.5480 26.7913 29.6054 43.3428 68.4636 116.3373 133.1318 154.4298 166.2803 203.0741 220.6475 226.5413 259.4247 284.0789 304.4674 328.3377 343.3279 363.5744 408.1323 421.2058 428.5224 446.5205 464.9768 498.0348 515.9988 537.6830 554.9320 586.3137 605.6337 608.3516 629.7032 678.5648 708.4104 715.8889 752.4149 765.5075 778.3843 780.9199 812.0954 812.7241 841.0030 843.0578 845.3457 892.3744 913.5591 920.3441 929.9798 939.4160 962.2266 967.5380 978.7744 998.1087 1003.5350 1013.4114 1044.6623 1052.2232 1056.4206 1065.4910 1065.5926 1084.8176 1107.9476 1119.3411 1123.9020 1140.0293 1141.6289 1169.7598 1186.0436 1198.3207 1227.0116 1243.4078 1249.8110 1260.1056 1264.8536 1272.4666 1287.4239 1294.8701 1325.4271 1330.3455 1336.4961 1358.2628 1363.5159 1365.3554 1377.4948 1387.1828 1410.0957 1412.3169 1439.9495 1454.2295 1457.0693 1460.9359 1462.0924 1464.8779 1466.5155 1473.6628 1478.0758 1487.4288 1512.2201 1536.8887 1563.2611 1610.7337 1630.5883 2848.8094 2856.5998 2868.9594 2974.2831 2977.0721 2983.8671 2985.2563 3009.2069 3028.6773 3048.9540 3065.1396 3085.6002 3103.5644 3104.7061 3116.9968 3125.3309 3133.3417 3174.0864 3174.8270 3179.1811
redmass: 2.3430 1.0291 5.1484 5.0596 4.8902 5.2558 3.8292 4.2173 5.2728 4.4565 4.9208 4.2389 5.7033 3.8014 2.8723 2.4379 3.3781 3.0193 3.0308 4.2279 2.1077 3.0025 4.0053 3.3154 2.8926 3.8003 5.5378 5.6553 5.0062 5.1608 4.5955 3.6919 2.2427 9.5054 5.4859 4.8213 5.3983 3.5996 4.5423 5.1881 1.4427 1.3383 5.4935 5.1727 1.6698 1.5333 2.6637 5.1089 1.3945 2.2222 1.4084 2.1306 5.0866 2.1250 2.1591 2.2492 1.6015 1.7151 3.4899 1.5868 2.0661 1.6699 2.1675 1.0366 1.7802 2.6556 2.2410 1.7203 1.7788 1.1758 1.8540 1.6421 5.0799 1.9797 2.7336 1.6622 1.5279 1.4559 1.3573 2.0670 1.3223 1.4359 1.4815 1.2870 1.7515 1.2479 2.5271 2.2857 4.6443 1.1153 1.1713 1.0924 1.1398 1.1744 1.0486 1.3611 1.5438 1.2240 3.9383 5.7688 5.7147 7.9505 8.3037 1.0705 1.0712 1.0692 1.0681 1.0686 1.0868 1.0379 1.0533 1.0896 1.0894 1.0971 1.1189 1.0935 1.0944 1.0986 1.0907 1.0898 1.0928 1.0963 1.0953
irintensity: 14.7385 0.5046 0.0564 0.1131 0.1930 0.4171 0.2122 0.1627 6.9667 1.5092 0.5829 1.9098 0.8067 1.8095 2.3000 0.4626 4.5928 8.8773 1.1911 5.9178 0.5035 10.8648 0.9814 2.2787 0.1889 4.0645 3.9802 8.0339 8.6967 4.0136 1.9948 3.3362 4.1965 0.9388 1.1597 1.1752 7.7380 14.0445 17.2759 0.5464 46.0442 45.6561 31.9970 13.4609 1.8424 27.6355 3.4918 4.4587 2.8271 2.4394 0.2907 34.0965 160.6749 82.4177 34.0361 12.0249 8.4771 0.4067 17.2472 8.7543 4.8517 2.5602 39.0792 0.0070 8.9663 14.9078 11.8795 20.7892 1.5777 7.0321 2.8021 52.5134 230.9520 29.2687 1.2750 21.5082 15.7280 46.1982 37.1354 109.8575 26.2796 2.5379 13.2163 2.3700 6.5181 29.8362 7.8894 91.1726 54.3948 28.2224 2.7719 22.2923 78.0830 33.3410 20.6781 67.6449 41.0222 16.5404 147.6541 159.7195 736.0381 4.3087 0.2103 35.0160 46.6443 160.2856 12.1989 106.2496 20.7291 16.6002 133.4086 58.6336 33.0576 17.4810 35.0088 4.6229 7.2942 12.4432 27.1491 10.4062 2.0189 14.6069 6.6209
temp: 298.150 k
press: 1.00000 atm
elementType: 8 8 7 7 7 7 6 6 6 6 6 6 6 6 6 6 6 6 6 6 6 6 6 1 1 1 1 1 1 1 1 1 1 1 1 1 1 1 1 1 1 1 1
symmnumber: 1
zpe: 912234.0 jmol-1
zpe.correction: 0.347452 hartree
zpe.thermalcorrener: 0.366230 hartree
zpe.thermalcorrenthalpy: 0.367174 hartree
zpe.thermalcorrgfe: 0.297860 hartree
zpe.sumelectzpe: -1027.539717 hartree
zpe.sumelectthermal: -1027.520939 hartree
zpe.sumelectthermalent: -1027.519994 hartree
zpe.sumelectthermalfe: -1027.589309 hartree
dipole: -0.2267 0.2254 0.8651
dipole: 0.9223
quadrupole: -121.4990 -129.2662 -133.5567
quadrupole: -1.2263 -6.5824 -2.3654
quadrupole: 6.6083 -1.1589 -5.4494 -1.2263 -6.5824 -2.3654
hfenergy: -1027.8871689 hartree
pointgroup: C01 [X(C17H20N4O2)]
dipole: 0.0880664 0.0498472 -0.3484625 debye
polarizability: 315.6567368|-16.9371834|187.8823853|-9.4716456|-2.0977998|168.8890715 unknown
InChI: InChI=1S/C17H20N4O2/c1-13-4-5-18-17(19-13)21-8-6-20(7-9-21)11-14-2-3-15-16(10-14)23-12-22-15/h2-5,10H,6-9,11-12H2,1H3
charge 0 multiplicity 1
43 atoms
O  -4.829491 1.200784 1.669797
O  -6.25589 1.236189 -0.266025
N  -0.322048 -1.234488 0.181181
N  2.331165 -0.273528 0.683044
N  3.984916 1.132721 -0.243528
N  4.570416 -1.017986 0.78755
C  0.192908 -0.037442 -0.532523
C  0.777091 -2.184053 0.48619
C  1.264888 0.675356 0.313704
C  1.856958 -1.500618 1.348348
C  -1.455265 -1.881219 -0.521229
C  -2.723658 -1.032167 -0.517994
C  3.663197 -0.048406 0.401765
C  -3.080293 -0.31018 0.659851
C  -3.565619 -0.999408 -1.655467
C  -4.274652 0.407567 0.631581
C  -5.11379 0.428959 -0.503676
C  -4.786672 -0.267069 -1.66817
C  5.299871 1.362047 -0.514169
C  -6.105123 1.737912 1.126798
C  5.873367 -0.754355 0.502133
C  6.303568 0.42264 -0.147672
C  5.642718 2.656486 -1.218703
H  0.632778 -0.315222 -1.524165
H  -0.648125 0.654499 -0.71569
H  0.360085 -3.043881 1.043414
H  1.255647 -2.576914 -0.446978
H  1.721436 1.50885 -0.240514
H  0.792522 1.067471 1.237424
H  1.416968 -1.233359 2.330802
H  2.721163 -2.162944 1.506456
H  -1.65494 -2.837119 0.005026
H  -1.199618 -2.149235 -1.578186
H  -2.418603 -0.321636 1.529691
H  -3.271798 -1.551944 -2.555312
H  -5.434472 -0.242414 -2.547994
H  -6.051946 2.840284 1.106884
H  -6.943547 1.359811 1.737534
H  6.590174 -1.525032 0.809476
H  7.359878 0.603086 -0.360879
H  6.29622 3.287869 -0.588084
H  6.18676 2.46282 -2.161661
H  4.721461 3.215169 -1.444429
