program: Gaussian 09
title: 000198993
version: EM64L-G09RevD.01
frameworkgroup: C1[X(C17H20N4O2)]
method: RPBEPBE
basis: SDD
operation: Freq
keyword: #p
keyword: freq=noraman
keyword: PBEPBE/SDD
title: #p freq=noraman PBEPBE/SDD
converged: YES YES NO NO
title: Mulliken charges:
elementType: O O N N N N C C C C C C C C C C C C C C C C C H H H H H H H H H H H H H H H H H H H H
charge: -0.269867 -0.265965 -0.101559 -0.139501 -0.091675 -0.090806 -0.078757 -0.368761 -0.343789 -0.409747 -0.490266 -0.709141 0.103378 0.507529 -0.484581 -0.459168 0.204756 0.157436 -0.326594 -0.285596 -0.285067 -0.202410 -0.199100 0.267367 0.207667 0.193972 0.192812 0.231344 0.220889 0.267530 0.197061 0.221059 0.211015 0.230643 0.231959 0.284052 0.237540 0.249236 0.240816 0.240637 0.235476 0.235950 0.232227
chargesum: 0.00000
title: Mulliken charges with hydrogens summed into heavy atoms:
elementType: O O N N N N C C C C C C C C C C C C C C C C C
charge: -0.269867 -0.265965 -0.101559 -0.139501 -0.091675 -0.090806 0.188609 0.032878 0.080366 0.078672 -0.072145 -0.035524 0.103378 0.507529 -0.200529 -0.221628 0.204756 0.157436 -0.077358 -0.044780 -0.044430 0.269017 0.033127
polarizability: 3.14561523e+02 1.15556600e+01 1.79421923e+02 -6.00943014e+00 -6.73461624e-01 1.70819485e+02
1716.lowfreq: -59.6997 -0.0007 0.0003 0.0005 2.4333 7.6009 9.0977 22.5449 29.6532
frequency: -59.6940 21.7731 29.4640 34.6402 42.7873 74.7618 119.7248 124.9128 131.9158 160.5734 176.3788 208.6261 221.9056 240.3074 252.6270 296.7597 317.9815 319.0639 356.8284 383.8019 407.7302 421.9502 430.9548 436.0097 482.0266 506.5571 531.4782 547.6975 552.6895 589.9536 608.3969 627.4561 677.5158 686.2502 714.5145 719.8283 752.5393 774.9732 777.9939 782.2132 791.3157 813.8635 840.8981 864.3955 892.7509 900.3267 914.0334 927.2241 931.0484 942.9701 953.6501 962.7178 965.4148 978.2188 983.9406 1019.0425 1043.0512 1055.7496 1056.2036 1064.6971 1075.1247 1079.6824 1088.3593 1112.9105 1119.3949 1124.7521 1144.3800 1159.5433 1171.7334 1177.8564 1216.3171 1222.7918 1245.2152 1249.7700 1262.0473 1280.7290 1293.8202 1298.8359 1310.5259 1330.2524 1348.0104 1355.6159 1360.4465 1365.3971 1373.2514 1384.6037 1388.4925 1405.7220 1410.3641 1440.4988 1453.7862 1462.1868 1466.0450 1471.4322 1473.9000 1478.1479 1485.9852 1486.7158 1505.0668 1506.1608 1568.3237 1610.7133 1630.7771 2845.9466 2851.6386 2863.6003 2981.1296 2985.2354 2987.1865 3009.3007 3029.5455 3051.3821 3057.0192 3082.9992 3085.9474 3097.4002 3100.5707 3124.1194 3124.7591 3134.3323 3174.1410 3179.9826 3186.8748
redmass: 2.3232 5.4217 4.9560 4.8579 5.0741 4.5187 5.2035 4.1163 3.7634 5.3540 3.7373 1.0537 6.0366 4.4542 3.2355 2.6880 3.3729 2.9305 3.5475 2.7160 4.1714 3.0209 3.1600 3.3176 3.9683 3.1221 3.9357 3.5443 4.0295 5.2303 5.3527 7.5890 7.7110 3.2669 4.6445 3.9411 5.3772 4.3344 1.8649 2.7803 2.5471 1.4670 10.0771 3.0029 1.4536 1.7640 2.6886 4.2587 1.3755 2.3635 1.3725 1.4743 2.0583 4.9266 2.5522 1.9676 2.1366 2.4784 3.5735 1.4599 1.7129 1.8995 1.8511 2.1460 1.0372 1.7796 1.9806 2.3552 1.7812 2.1655 1.6510 1.2511 1.8918 4.6328 1.9241 1.5359 1.3121 1.9875 1.7035 1.3286 1.4268 1.3767 1.4449 1.2821 1.3218 1.5928 1.6092 1.8551 2.4116 4.7418 1.1040 1.1741 1.1271 1.0997 1.2771 1.5381 1.1018 1.2381 4.4308 5.3494 5.7439 7.9896 8.3088 1.0707 1.0715 1.0692 1.0657 1.0865 1.0384 1.0534 1.0887 1.0890 1.0862 1.0979 1.1189 1.0999 1.0940 1.0902 1.0927 1.0898 1.0927 1.0953 1.0981
irintensity: 14.6507 0.0549 0.0935 0.1813 0.2022 0.2030 0.1599 6.3304 4.2215 0.2523 0.4264 0.0755 0.0813 1.4363 1.8621 3.6677 0.4510 2.1093 3.5277 11.8210 0.0132 10.0752 3.5193 3.6565 5.9844 6.5339 3.0943 8.7019 0.1378 2.7580 3.6071 3.7026 0.9961 0.1228 1.1037 1.6291 7.1011 28.1750 12.6207 8.1026 50.2698 46.7324 33.4897 1.1367 19.8523 30.4300 8.7247 5.5996 2.2079 30.5111 0.0040 0.7308 8.9536 118.6144 54.0761 3.2364 85.4786 2.7556 20.3764 4.3719 1.9016 5.9972 57.0104 4.4204 0.0069 7.4795 10.0404 10.9939 27.5430 9.0460 3.2186 78.8122 2.3935 216.6897 6.4206 2.7742 12.1673 38.6305 29.2142 18.4206 86.7038 7.5813 8.8434 2.0515 11.5918 22.9829 61.4955 0.7080 5.9118 58.7931 28.9789 52.7879 19.4438 66.8008 57.9109 45.5913 14.9863 18.8320 278.8092 119.4552 562.1533 4.1967 0.2034 30.5237 41.0315 193.0733 35.2040 19.5146 37.1284 132.5569 36.8877 28.5812 8.3209 40.4735 35.4070 27.4036 2.9762 28.8412 31.2107 10.2983 2.1125 6.4577 18.8487
temp: 298.150 k
press: 1.00000 atm
elementType: 8 8 7 7 7 7 6 6 6 6 6 6 6 6 6 6 6 6 6 6 6 6 6 1 1 1 1 1 1 1 1 1 1 1 1 1 1 1 1 1 1 1 1
symmnumber: 1
zpe: 913910.3 jmol-1
zpe.correction: 0.348090 hartree
zpe.thermalcorrener: 0.367338 hartree
zpe.thermalcorrenthalpy: 0.368282 hartree
zpe.thermalcorrgfe: 0.298573 hartree
zpe.sumelectzpe: -1027.531495 hartree
zpe.sumelectthermal: -1027.512247 hartree
zpe.sumelectthermalent: -1027.511303 hartree
zpe.sumelectthermalfe: -1027.581013 hartree
dipole: -0.0357 0.5186 -0.3859
dipole: 0.6474
quadrupole: -122.6673 -129.6415 -134.3507
quadrupole: 2.0120 -4.1732 -1.8354
quadrupole: 6.2192 -0.7549 -5.4642 2.0120 -4.1732 -1.8354
hfenergy: -1027.8795852 hartree
pointgroup: C01 [X(C17H20N4O2)]
dipole: -0.0185814 0.1967637 -0.1606787 debye
polarizability: 314.0636807|13.0079688|179.6588891|-8.2782039|-1.3040592|171.0803616 unknown
InChI: InChI=1S/C17H20N4O2/c1-13-10-20(7-8-21(13)17-18-5-2-6-19-17)11-14-3-4-15-16(9-14)23-12-22-15/h2-6,9,13H,7-8,10-12H2,1H3
charge 0 multiplicity 1
43 atoms
O  -4.540803 -1.262898 1.683971
O  -6.108369 -1.152615 -0.136745
N  -0.083325 1.126797 -0.040252
N  2.555679 0.045161 0.185522
N  4.096458 -1.495799 -0.735519
N  4.85622 0.542776 0.404805
C  2.214101 1.273786 0.951105
C  1.075212 2.017498 0.213308
C  0.326562 -0.017016 -0.892187
C  1.428734 -0.831623 -0.194055
C  -1.253974 1.858142 -0.580752
C  1.859442 0.945324 2.420203
C  3.865792 -0.312001 -0.053155
C  -2.541719 1.041445 -0.530179
C  -2.829883 0.260715 0.628973
C  -3.467424 1.095034 -1.599878
C  -4.042954 -0.425002 0.651982
C  -4.964768 -0.3607 -0.4155
C  -4.705738 0.393124 -1.56096
C  5.394976 -1.815839 -0.968211
C  6.137627 0.177075 0.144935
C  -5.870732 -1.732359 1.213165
C  6.478987 -1.008739 -0.547594
H  3.118329 1.904772 0.93715
H  0.740397 2.867316 0.837032
H  1.484898 2.433499 -0.742913
H  0.698562 0.335421 -1.888429
H  -0.549908 -0.665757 -1.066192
H  1.005817 -1.310927 0.711614
H  1.822273 -1.620036 -0.853139
H  -1.0841 2.205772 -1.631918
H  -1.374153 2.771608 0.036618
H  1.72872 1.880488 2.99531
H  0.919335 0.371199 2.487189
H  2.673485 0.366162 2.889698
H  -2.105153 0.204411 1.445176
H  -3.226662 1.691875 -2.487076
H  -5.417439 0.434488 -2.389226
H  5.562758 -2.754682 -1.509514
H  6.9106 0.863053 0.511829
H  -6.648122 -1.362848 1.904692
H  -5.855914 -2.833071 1.132971
H  7.516872 -1.286725 -0.74215
