program: Gaussian 09
title: 000198990
version: EM64L-G09RevD.01
frameworkgroup: C1[X(C18H22N4O2)]
method: RPBEPBE
basis: SDD
operation: Freq
keyword: #p
keyword: freq=noraman
keyword: PBEPBE/SDD
title: #p freq=noraman PBEPBE/SDD
converged: YES YES NO NO
title: Mulliken charges:
elementType: O O N N N N C C C C C C C C C C C C C C C C C C H H H H H H H H H H H H H H H H H H H H H H
charge: -0.270041 -0.266477 -0.098981 -0.128023 -0.114611 -0.072496 -0.348320 -0.352069 -0.401647 -0.389961 -0.494016 0.507590 0.057961 -0.486203 -0.458059 0.204486 0.157113 -0.326554 0.115615 0.293181 -0.421734 -0.202308 -0.769214 -0.793581 0.229428 0.196286 0.187820 0.210150 0.261680 0.216137 0.212288 0.263366 0.220439 0.197237 0.288560 0.237106 0.248742 0.240272 0.235168 0.235261 0.226048 0.224851 0.251147 0.223877 0.225868 0.226619
chargesum: 0.00000
title: Mulliken charges with hydrogens summed into heavy atoms:
elementType: O O N N N N C C C C C C C C C C C C C C C C C C
charge: -0.270041 -0.266477 -0.098981 -0.128023 -0.114611 -0.072496 0.077395 0.045901 0.076169 0.085693 -0.076339 0.507590 0.057961 -0.197643 -0.220954 0.204486 0.157113 -0.077812 0.115615 0.293181 -0.181462 0.268121 -0.067168 -0.117217
polarizability: 3.40038703e+02 1.51671442e+01 1.97272433e+02 -1.12777425e+01 -2.27345177e-01 1.77082735e+02
1716.lowfreq: -54.6772 -12.1748 -4.3151 -0.0010 -0.0007 0.0002 5.5232 15.4628 25.1980
frequency: -54.6635 14.8020 25.0925 27.7336 41.0770 62.7507 88.3506 93.5886 112.8678 140.7193 149.1604 160.4403 203.0953 220.3579 225.0848 254.5305 272.3851 282.0854 295.9206 307.9205 329.3906 348.9849 376.8286 409.0273 421.0778 424.3697 445.9221 468.3625 500.1492 519.6605 535.4488 554.9372 581.7986 606.0962 613.7233 623.6568 678.5473 688.3794 715.8501 734.7385 752.4765 765.8769 778.3153 780.5048 812.0854 842.2357 845.5269 847.5916 892.6863 913.8746 926.0547 929.7971 937.0058 941.6112 978.8646 991.4288 999.0596 1003.3935 1011.2349 1028.0648 1052.5274 1053.7300 1056.2194 1062.8751 1065.8560 1102.0277 1119.3116 1121.0888 1138.3640 1140.6813 1160.6494 1169.7700 1183.6418 1199.0770 1225.4124 1244.4896 1249.6789 1264.1028 1269.3707 1285.4418 1288.9510 1294.4531 1325.1360 1331.8563 1336.7960 1358.2168 1363.4564 1365.3763 1377.1121 1385.9773 1403.3759 1407.7431 1410.0428 1439.7734 1454.1633 1455.8294 1459.5666 1461.5063 1462.0690 1463.7033 1465.4485 1471.6918 1473.7224 1477.9610 1487.8830 1506.1586 1529.9361 1579.6033 1610.7082 1630.7390 2847.4830 2856.1440 2868.3028 2965.2859 2970.3727 2973.1677 2977.6291 2984.0191 3008.5950 3027.9460 3038.7189 3048.1737 3052.6444 3073.3970 3084.6901 3101.3013 3102.8994 3108.1510 3117.8110 3133.2470 3173.9425 3178.9858
redmass: 2.3559 4.8341 4.8597 4.7853 5.3051 3.5234 2.7194 1.1657 3.9833 1.1183 4.1620 4.8600 4.2078 5.7488 3.9036 2.6753 2.5714 2.5493 3.0041 4.1934 3.1153 5.0217 2.7729 2.1343 2.9950 3.9333 3.3444 2.8550 5.3735 5.1079 3.8989 5.0619 4.8846 5.4847 2.9220 2.6847 9.5453 3.7656 4.8264 5.8801 5.3892 3.5731 4.5381 7.9685 1.4489 8.2659 1.6446 4.7777 1.5373 2.5733 1.3743 1.4071 2.1942 2.4055 5.1019 1.6199 2.0565 2.0550 2.0848 1.4402 1.7006 1.6566 3.4169 2.2816 1.4580 2.4058 1.0375 1.8220 2.6528 2.2060 3.5570 1.7280 1.9846 1.1717 1.8163 1.6253 5.0616 2.0898 1.8828 1.7369 1.6815 1.4411 1.3800 2.8156 1.3559 1.4333 1.5147 1.2869 1.7494 1.2881 1.3760 2.1011 2.5140 4.6468 1.1176 1.1398 1.0518 1.1145 1.1518 1.3107 1.2015 1.0463 1.3664 1.5602 1.2126 2.7507 4.4988 6.0789 7.9521 8.3082 1.0706 1.0711 1.0692 1.0372 1.0682 1.0686 1.0386 1.0868 1.0533 1.0896 1.0977 1.0894 1.0965 1.0982 1.1189 1.0934 1.0939 1.0922 1.0980 1.0898 1.0928 1.0953
irintensity: 14.7596 0.1095 0.1028 0.2711 0.4887 0.2119 2.4200 1.3902 0.1470 0.1160 2.7736 1.0902 1.8027 0.8395 1.8375 2.2619 0.3612 0.3755 4.1363 0.7954 8.1969 5.8785 0.4086 0.5497 10.6771 1.2084 1.0479 1.1094 3.7585 5.2977 3.1608 8.0408 7.4069 3.2920 0.4646 3.1593 0.9534 0.5503 1.1760 0.5970 7.5878 14.2579 17.8420 7.9326 46.8523 34.5546 1.7406 22.3659 27.0178 5.0130 5.9388 2.6515 0.4418 8.2448 169.4375 9.0584 106.2012 28.3987 8.9719 11.1588 0.2740 0.1754 16.7016 9.6941 4.2639 15.8988 0.0763 28.0599 16.9031 13.0567 25.7425 20.7773 8.0749 7.0099 3.8766 36.4623 229.7423 5.0796 40.0281 4.9885 14.5277 65.0096 36.5757 88.6542 28.6280 4.1870 25.2198 2.3042 6.0968 15.2267 40.6857 103.0168 11.2075 54.4831 30.1630 3.6143 2.0416 41.9496 67.8222 16.7628 25.6447 33.1237 70.0359 42.6698 14.9309 129.5240 385.3634 496.4825 4.3055 0.2102 36.5815 46.9545 158.0723 74.7344 12.9317 108.8833 16.3056 21.1448 134.3221 60.4829 29.3070 34.8208 13.9143 22.6168 35.3092 5.0855 7.9297 38.8182 11.4648 10.4486 2.0143 6.8322
temp: 298.150 k
press: 1.00000 atm
elementType: 8 8 7 7 7 7 6 6 6 6 6 6 6 6 6 6 6 6 6 6 6 6 6 6 1 1 1 1 1 1 1 1 1 1 1 1 1 1 1 1 1 1 1 1 1 1
symmnumber: 1
zpe: 983741.8 jmol-1
zpe.correction: 0.374687 hartree
zpe.thermalcorrener: 0.395953 hartree
zpe.thermalcorrenthalpy: 0.396897 hartree
zpe.thermalcorrgfe: 0.322013 hartree
zpe.sumelectzpe: -1066.768066 hartree
zpe.sumelectthermal: -1066.746801 hartree
zpe.sumelectthermalent: -1066.745856 hartree
zpe.sumelectthermalfe: -1066.820741 hartree
dipole: -0.8403 0.3624 0.9475
dipole: 1.3172
quadrupole: -123.0614 -136.1006 -139.9228
quadrupole: -1.8064 -6.4387 -2.7496
quadrupole: 9.9668 -3.0724 -6.8945 -1.8064 -6.4387 -2.7496
hfenergy: -1067.1427537 hartree
pointgroup: C01 [X(C18H22N4O2)]
dipole: 0.3294436 0.1037908 -0.3863467 debye
polarizability: 340.1005678|-15.8102554|196.9949246|-9.9619352|-1.8801598|177.2983791 unknown
InChI: InChI=1S/C18H22N4O2/c1-13-10-19-18(20-14(13)2)22-7-5-21(6-8-22)11-15-3-4-16-17(9-15)24-12-23-16/h3-4,9-10H,5-8,11-12H2,1-2H3
charge 0 multiplicity 1
46 atoms
O  -5.167854 1.209494 1.663454
O  -6.576224 1.284174 -0.284553
N  -0.671837 -1.251394 0.183881
N  1.986849 -0.323726 0.714382
N  3.67203 1.082781 -0.158176
N  4.222497 -1.081111 0.840945
C  -0.139101 -0.052538 -0.514332
C  0.415688 -2.216098 0.486018
C  0.934536 0.639939 0.346444
C  1.496698 -1.552794 1.361975
C  -1.805159 -1.879172 -0.535554
C  -3.065009 -1.017551 -0.533498
C  3.326938 -0.102965 0.459066
C  -3.424848 -0.306255 0.64988
C  -3.896183 -0.961654 -1.678003
C  -4.611521 0.423984 0.619946
C  -5.43994 0.468385 -0.522338
C  -5.109359 -0.21634 -1.692532
C  4.992855 1.307546 -0.405884
C  6.001246 0.359261 -0.046081
C  5.530166 -0.820663 0.578099
C  -6.431593 1.768586 1.115003
C  5.34275 2.613756 -1.083875
C  7.472958 0.589264 -0.310569
H  -0.971964 0.649504 -0.696744
H  0.304918 -0.326163 -1.505352
H  0.895872 -2.603356 -0.448742
H  -0.014848 -3.07741 1.030677
H  1.404697 1.473463 -0.196526
H  0.458556 1.030249 1.269451
H  1.053233 -1.294457 2.345613
H  2.353381 -2.225818 1.517001
H  -2.018508 -2.838962 -0.022044
H  -1.542863 -2.137494 -1.593444
H  -2.770708 -0.335286 1.525025
H  -3.599947 -1.505737 -2.5822
H  -5.748636 -0.173919 -2.577905
H  6.238156 -1.601989 0.884023
H  -6.364581 2.870464 1.107935
H  -7.280264 1.394737 1.714141
H  6.018862 3.222838 -0.453831
H  5.869105 2.439725 -2.041775
H  4.423682 3.18686 -1.278688
H  8.073959 -0.266554 0.04498
H  7.682766 0.720079 -1.389809
H  7.847747 1.496622 0.20142
