program: Gaussian 09
title: 000198986
version: EM64L-G09RevD.01
frameworkgroup: C1[X(C16H19N5O2)]
method: RPBEPBE
basis: SDD
operation: Freq
keyword: #p
keyword: freq=noraman
keyword: PBEPBE/SDD
title: #p freq=noraman PBEPBE/SDD
converged: YES YES NO NO
title: Mulliken charges:
elementType: O O N N N N N C C C C C C C C C C C C C C C C H H H H H H H H H H H H H H H H H H H
charge: -0.270264 -0.266731 -0.099022 -0.126197 -0.143376 -0.106258 -0.634422 -0.347640 -0.352552 -0.398074 -0.389247 -0.492466 0.506347 0.102850 -0.487162 -0.457331 0.204366 0.156764 -0.326917 -0.202292 0.225974 -0.269376 -0.350806 0.196357 0.228031 0.209603 0.188747 0.256648 0.215712 0.210822 0.266249 0.220831 0.196789 0.289417 0.236981 0.248574 0.235180 0.234697 0.233095 0.220897 0.312926 0.322278
chargesum: 0.00000
title: Mulliken charges with hydrogens summed into heavy atoms:
elementType: O O N N N N N C C C C C C C C C C C C C C C C
charge: -0.270264 -0.266731 -0.099022 -0.126197 -0.143376 -0.106258 0.000781 0.076748 0.045799 0.074286 0.087824 -0.074846 0.506347 0.102850 -0.197745 -0.220349 0.204366 0.156764 -0.078343 0.267584 0.225974 -0.036282 -0.129909
polarizability: 3.11003488e+02 1.31524990e+01 1.90683471e+02 -1.18574598e+01 3.45501376e+00 1.64265295e+02
1716.lowfreq: -58.8634 -3.1977 -0.0007 -0.0004 0.0004 2.1116 7.3062 16.0173 27.2608
frequency: -58.8622 15.6079 27.1219 30.1509 43.6015 69.6758 117.6575 136.7502 156.2963 168.7699 206.8877 221.0906 229.1738 261.3321 284.0640 305.1215 328.4573 352.3383 373.5388 389.1688 408.5431 421.3876 428.4037 447.6524 466.6502 507.1005 508.7632 516.7541 540.0507 558.8990 587.0912 605.9576 627.0666 678.3640 681.9631 715.3525 715.7539 752.1706 760.3942 765.7368 778.1211 792.3071 811.7179 842.1700 845.7501 870.0895 893.4960 913.1765 916.1229 930.0051 939.6642 951.4049 976.8873 978.6317 1000.6722 1003.8146 1036.3048 1053.0154 1055.8226 1065.4739 1069.9192 1089.2663 1113.7305 1119.3880 1128.1834 1140.2714 1142.3087 1169.4314 1191.2277 1199.1527 1239.4913 1248.7237 1252.3391 1265.7722 1286.0432 1291.3241 1297.9746 1324.7748 1332.6422 1336.3914 1343.7305 1358.5649 1365.1358 1366.0343 1377.5023 1409.9474 1436.9173 1439.6789 1454.0854 1460.4053 1462.1822 1464.7057 1474.0218 1478.1340 1487.2825 1513.2583 1553.1144 1568.2556 1610.6491 1618.7590 1630.7366 2847.1807 2856.4394 2868.4928 2970.5752 2973.4475 2983.6885 3008.1336 3027.2438 3046.4331 3084.6378 3100.7912 3103.7457 3125.7410 3132.7294 3172.1602 3173.9329 3179.3249 3551.7113 3708.6879
redmass: 2.3344 5.2927 5.6435 4.9643 5.6427 4.0829 4.4019 5.0141 4.5716 5.0195 5.8515 5.8937 4.3073 2.7682 2.4395 3.3934 2.9993 4.3579 3.1177 1.1929 2.0459 3.0063 3.8589 2.4863 2.8424 3.5410 1.2572 5.3930 5.9169 5.4045 5.3415 5.4524 2.1200 9.4819 4.1705 5.5610 4.7942 5.3889 2.5049 3.5880 4.5172 2.5203 1.4464 8.4467 1.6179 3.9397 1.5561 3.1274 4.4027 1.3872 2.2199 1.3946 2.4579 4.9134 2.1778 2.1243 2.0809 1.7306 3.4550 1.4601 2.1429 1.7805 1.9029 1.0382 1.7562 2.7001 2.1886 1.7138 1.4547 1.2350 1.6806 2.6352 1.9268 1.5529 1.6918 1.6813 3.1545 1.3423 1.6025 1.3480 2.3512 1.4544 1.3092 1.5261 1.7513 2.5046 3.3623 4.6173 1.1189 1.0973 1.1500 1.1776 1.3546 1.5445 1.2245 4.4115 3.3723 5.4453 7.9497 1.4940 8.3176 1.0706 1.0710 1.0691 1.0682 1.0688 1.0867 1.0535 1.0897 1.0893 1.1187 1.0936 1.0934 1.0903 1.0898 1.0965 1.0927 1.0953 1.0448 1.1045
irintensity: 14.6124 0.1307 0.4353 0.1741 0.9795 0.7453 0.4911 6.8045 0.8150 0.7714 4.5783 0.6052 2.2759 3.2366 0.4231 4.8299 9.3681 4.6949 8.1596 206.8877 1.3039 10.8122 1.4294 10.9952 0.6829 8.0931 75.4902 3.9476 4.4133 6.8909 4.0870 3.5246 2.3078 0.9179 2.1767 1.7729 1.3322 8.1930 2.1218 15.0371 16.8623 66.9302 48.6079 31.3419 1.3746 10.8191 28.3769 6.3946 2.9437 2.8141 3.2964 0.4719 71.0760 132.4159 64.1351 38.0624 7.7977 0.4080 19.6466 4.4273 1.0179 9.8144 55.4974 0.2319 3.8211 14.4127 9.6553 21.2120 0.6110 7.1921 0.4427 264.4137 51.9784 43.8219 32.0077 28.2787 2.0334 33.5582 136.3127 24.9965 56.7661 4.0347 1.8307 5.9850 8.0147 7.8906 159.4970 47.5160 31.4998 27.9187 53.7737 34.5932 62.9488 41.7056 16.3567 220.3596 292.3166 742.3987 4.4807 324.7311 0.2714 38.1579 43.2028 160.7534 13.2803 111.9025 20.9890 135.0364 61.0646 35.4839 35.2527 6.2501 6.3733 28.6874 10.5239 19.5884 2.0020 6.9258 67.7813 33.2848
temp: 298.150 k
press: 1.00000 atm
elementType: 8 8 7 7 7 7 7 6 6 6 6 6 6 6 6 6 6 6 6 6 6 6 6 1 1 1 1 1 1 1 1 1 1 1 1 1 1 1 1 1 1 1
symmnumber: 1
zpe: 885787.2 jmol-1
zpe.correction: 0.337379 hartree
zpe.thermalcorrener: 0.356537 hartree
zpe.thermalcorrenthalpy: 0.357481 hartree
zpe.thermalcorrgfe: 0.287652 hartree
zpe.sumelectzpe: -1043.596379 hartree
zpe.sumelectthermal: -1043.577221 hartree
zpe.sumelectthermalent: -1043.576277 hartree
zpe.sumelectthermalfe: -1043.646106 hartree
dipole: -0.9334 1.7709 1.5433
dipole: 2.5276
quadrupole: -114.5631 -122.5587 -133.8568
quadrupole: -10.4512 -10.8204 0.7453
quadrupole: 9.0964 1.1008 -10.1973 -10.4512 -10.8204 0.7453
hfenergy: -1043.9337575 hartree
pointgroup: C01[X(C16H19N5O2)]
dipole: 0.365068 0.5946578 -0.70855 debye
polarizability: 310.7690472|-15.2940235|189.1376105|-10.6296047|-7.1457797|166.0455952 unknown
InChI: InChI=1S/C16H19N5O2/c17-15-3-4-18-16(19-15)21-7-5-20(6-8-21)10-12-1-2-13-14(9-12)23-11-22-13/h1-4,9H,5-8,10-11,17H2
charge 0 multiplicity 1
42 atoms
O  -4.814774 1.303509 1.589052
O  -6.256689 1.197043 -0.3328
N  -0.30961 -1.218053 0.250359
N  2.345499 -0.225279 0.675815
N  3.989146 1.122557 -0.338914
N  4.582953 -0.965704 0.802576
N  5.596222 2.478402 -1.345018
C  0.19724 -0.061123 -0.533013
C  0.795702 -2.146658 0.599402
C  1.2753 0.698474 0.263921
C  1.881227 -1.413922 1.412113
C  -1.441213 -1.908231 -0.411574
C  -2.713953 -1.066881 -0.455229
C  3.676851 -0.015591 0.36935
C  -3.065783 -0.267226 0.672807
C  -3.565754 -1.11754 -1.585005
C  -4.264642 0.440414 0.604712
C  -5.112778 0.378709 -0.521966
C  -4.791022 -0.394484 -1.638245
C  -6.104415 1.783643 1.026044
C  5.305078 1.331424 -0.632019
C  5.886388 -0.71652 0.489336
C  6.323787 0.412976 -0.224672
H  0.629742 -0.393581 -1.511122
H  -0.647565 0.617253 -0.747987
H  0.38448 -2.974917 1.206696
H  1.267099 -2.589121 -0.314976
H  1.725008 1.499878 -0.340965
H  0.808092 1.142873 1.166719
H  1.450195 -1.0958 2.383645
H  2.750703 -2.062747 1.596566
H  -1.636086 -2.833623 0.168319
H  -1.185994 -2.235021 -1.452188
H  -2.397008 -0.215699 1.535803
H  -3.276178 -1.729639 -2.446943
H  -5.445863 -0.434585 -2.512259
H  -6.072053 2.883506 0.939989
H  -6.931108 1.427833 1.665985
H  6.606575 -1.468323 0.833217
H  7.380184 0.574288 -0.452454
H  6.549243 2.713932 -1.604406
H  4.828178 3.095157 -1.600574
