program: Gaussian 09
title: 000199024
version: EM64L-G09RevD.01
frameworkgroup: C1[X(C17H28NO2)]
method: RPBEPBE
basis: SDD
operation: Freq
keyword: #p
keyword: freq=noraman
keyword: PBEPBE/SDD
title: #p freq=noraman PBEPBE/SDD
converged: YES YES NO NO
title: Mulliken charges:
elementType: O O N C C C C C C C C C C C C C C C C C H H H H H H H H H H H H H H H H H H H H H H H H H H H H
charge: -0.226074 -0.320620 -0.091829 0.274724 -0.469799 -0.339368 -0.360992 -0.436160 -0.313503 -0.334598 -0.603186 -0.684961 -0.693158 0.265371 0.294272 -0.341841 -0.374576 -0.787851 -0.242314 -0.231853 0.256999 0.296838 0.233441 0.193069 0.216682 0.257874 0.196503 0.271724 0.258901 0.267019 0.326660 0.253018 0.256943 0.269694 0.281069 0.232466 0.250830 0.271976 0.272504 0.227739 0.246939 0.252308 0.246990 0.241488 0.241863 0.207935 0.242695 0.246150
chargesum: 1.00000
title: Mulliken charges with hydrogens summed into heavy atoms:
elementType: O O N C C C C C C C C C C C C C C C C C
charge: -0.226074 -0.320620 -0.091829 0.274724 0.084038 0.087141 0.113563 0.032068 0.212416 0.245080 0.204520 0.070311 0.054025 0.265371 0.294272 -0.089533 -0.127586 -0.096565 0.000381 0.014297
polarizability: 2.30862489e+02 1.24133476e+01 1.64155089e+02 6.73485675e+00 -1.07638517e+01 1.75626970e+02
1716.lowfreq: -10.8110 -0.0001 0.0007 0.0007 3.1624 7.5714 24.4565 30.7606 34.1265
frequency: 24.2360 30.6673 34.0047 52.9955 84.7405 93.7110 104.9160 109.5461 123.2731 132.1591 164.5837 174.4641 187.3661 202.9805 229.1663 240.0448 269.4611 279.6009 287.0012 294.1700 318.5694 336.2588 345.0842 367.4399 388.0548 396.7395 440.1745 447.3572 473.9065 492.8258 524.9774 535.2740 538.6962 594.6790 683.4394 710.8901 713.6669 760.2148 762.8619 777.3384 789.9672 802.5141 810.4146 815.4724 849.0174 855.1904 887.3531 891.4465 932.6740 938.6958 939.2021 955.6189 965.8700 981.6038 984.6961 989.3118 1002.5355 1008.7260 1034.1178 1045.9404 1050.5373 1076.5669 1080.7695 1089.6170 1097.7190 1102.6355 1115.6784 1119.6509 1137.4119 1171.9227 1180.6640 1183.1551 1186.1814 1198.9360 1225.4602 1232.4174 1273.2810 1278.0931 1290.9911 1298.1920 1309.3250 1326.7339 1334.9034 1361.6025 1372.4101 1381.0272 1390.5654 1394.6776 1400.2166 1408.4307 1411.1583 1431.0090 1435.9875 1455.9037 1463.3822 1466.3071 1470.6728 1471.2810 1472.6729 1474.1144 1479.1208 1481.8296 1485.5537 1488.2376 1494.2700 1495.3108 1499.7712 1511.3522 1597.0642 1611.1619 2936.1942 2975.8549 2979.5407 3001.1112 3001.8495 3003.4792 3010.8510 3029.7865 3030.5809 3034.1064 3040.3503 3049.6499 3050.1171 3087.6788 3089.3610 3089.5404 3096.3093 3097.9449 3098.1189 3100.5788 3116.8899 3119.3840 3136.6522 3145.2848 3150.2587 3159.8638 3159.9196 3176.5121
redmass: 4.3202 3.5927 3.7006 5.2114 4.2219 2.5085 1.3344 2.0817 2.3221 2.5538 3.3879 2.0992 3.4704 1.5467 2.6737 1.2138 4.0391 2.1155 2.8669 2.1944 2.1950 1.6757 1.6471 2.6459 1.9915 2.4296 2.8004 2.4235 3.5486 2.9913 3.1738 3.5510 3.9344 6.5669 3.2777 3.6669 3.2553 1.4028 3.9999 1.5380 1.4624 1.8596 2.8244 3.5861 1.8078 1.7001 2.7904 2.7710 2.0623 1.5186 2.8097 2.1947 1.7420 1.5597 1.9292 1.3825 4.5144 2.1326 2.8392 1.5310 2.1137 1.7066 1.7406 1.2869 1.4909 1.3923 2.3746 1.6733 1.8613 1.9687 1.6743 1.5196 1.6154 1.8335 2.3187 1.5434 1.2373 1.6697 1.4434 1.1439 1.1995 1.5155 1.3755 1.2759 1.7114 1.8424 1.5665 1.4102 1.2501 1.1950 1.1950 1.9049 1.1643 1.0944 1.0543 1.0648 1.0663 1.0656 1.1178 1.2446 1.0731 1.2131 1.2085 1.3028 1.0661 1.1115 1.0593 1.0903 5.9966 7.1028 1.0626 1.0388 1.0580 1.0378 1.0633 1.0381 1.0976 1.0616 1.0610 1.0613 1.0338 1.1077 1.0959 1.1012 1.1005 1.1061 1.1009 1.0989 1.0986 1.1049 1.1036 1.1025 1.0879 1.0884 1.1043 1.0943 1.1034 1.1007
irintensity: 1.4651 0.2939 0.3283 9.0185 0.0141 2.3935 0.2876 1.4997 2.8501 5.3580 5.4974 0.3484 9.5457 1.2444 0.1275 0.0422 0.8392 0.6612 0.3580 0.4390 0.4528 1.9467 0.2735 1.6320 0.6439 0.4081 5.1244 2.2859 1.5131 0.4063 1.9809 0.4745 0.6995 2.4503 1.5790 1.9803 6.7572 83.0897 28.7679 19.6686 23.8731 19.7605 25.8944 5.2988 1.4460 2.7833 6.6159 15.6487 9.2419 4.7473 14.3256 11.5946 13.8467 4.6893 8.9950 0.7148 68.2815 25.2776 10.8843 6.4682 13.6901 0.8471 0.3598 3.9481 1.6588 2.0222 131.8746 7.3027 10.4413 85.2494 3.3874 8.9742 13.4021 5.2414 45.0364 18.7032 4.1048 4.8633 0.8316 0.9530 3.5137 0.9931 5.0352 2.1082 1.4085 2.9641 9.6069 8.1615 11.2420 15.8565 31.8530 27.9106 27.8525 20.5664 10.5847 7.2637 1.5819 13.5942 22.4451 5.1862 12.3997 52.2903 78.5391 45.5761 15.6052 6.5393 3.7945 24.1806 24.4886 4.7732 51.4513 32.1676 79.6381 7.5612 21.7485 4.5198 22.8945 5.7463 1.2963 13.0011 4.1281 27.2605 27.9539 13.7331 1.9730 25.8741 11.3239 7.8606 18.2917 8.4394 23.3255 7.3821 6.0902 5.3553 4.4261 22.0537 2.5115 8.8840
temp: 298.150 k
press: 1.00000 atm
elementType: 8 8 7 6 6 6 6 6 6 6 6 6 6 6 6 6 6 6 6 6 1 1 1 1 1 1 1 1 1 1 1 1 1 1 1 1 1 1 1 1 1 1 1 1 1 1 1 1
symmnumber: 1
zpe: 1106196.5 jmol-1
zpe.correction: 0.421328 hartree
zpe.thermalcorrener: 0.443199 hartree
zpe.thermalcorrenthalpy: 0.444143 hartree
zpe.thermalcorrgfe: 0.369995 hartree
zpe.sumelectzpe: -867.930885 hartree
zpe.sumelectthermal: -867.909014 hartree
zpe.sumelectthermalent: -867.908070 hartree
zpe.sumelectthermalfe: -867.982217 hartree
dipole: 8.1676 -5.8274 -0.9762
dipole: 10.0807
quadrupole: -71.5184 -117.1756 -104.8926
quadrupole: -12.5766 0.4180 -2.5524
quadrupole: 26.3438 -19.3134 -7.0304 -12.5766 0.4180 -2.5524
hfenergy: -868.3522127 hartree
pointgroup: C01 [X(C17H28N1O2)]
dipole: -3.316099 -2.015626 -0.8187567 debye
polarizability: 227.6368092|-19.6048584|160.7740762|5.8860414|1.7196588|182.2336618 unknown
InChI: InChI=1S/C17H28NO2/c1-5-18(4,6-2)11-17(12-19-13-17)14-20-16-10-8-7-9-15(16)3/h7-10H,5-6,11-14H2,1-4H3
charge 1 multiplicity 1
48 atoms
O  -1.649436 3.540207 1.22714
O  0.895065 0.482587 0.020634
N  -2.465513 -0.70495 -0.434204
C  -1.236897 1.501087 0.497041
C  -1.91905 0.73911 -0.658176
C  -2.149389 2.169952 1.584075
C  -0.921065 2.972623 0.033806
C  0.006829 0.84959 1.120767
C  -3.565132 -0.966464 -1.508989
C  -1.305849 -1.720765 -0.697824
C  -3.045944 -0.886241 0.958336
C  -4.911355 -0.272575 -1.272228
C  -1.567452 -3.156131 -0.231606
C  2.201399 0.002197 0.353446
C  3.045381 -0.25783 -0.760722
C  2.6262 -0.206692 1.683699
C  4.344826 -0.744963 -0.486538
C  2.569704 -0.004433 -2.177677
C  3.933364 -0.691807 1.92115
C  4.793639 -0.963525 0.837412
H  -2.78295 1.336822 -0.992533
H  -1.205084 0.651369 -1.495602
H  -1.925833 1.922916 2.637888
H  -3.238413 2.086485 1.401651
H  -1.399836 3.286474 -0.912873
H  0.144462 3.253704 0.031133
H  -0.240316 -0.045857 1.733253
H  0.493952 1.58577 1.790729
H  -3.699707 -2.060158 -1.54249
H  -3.117673 -0.644879 -2.465681
H  -0.406491 -1.296835 -0.226002
H  -1.144679 -1.685545 -1.79019
H  -2.235086 -0.861464 1.699564
H  -3.763449 -0.080777 1.163529
H  -3.560442 -1.856194 1.011063
H  -4.834761 0.825948 -1.198266
H  -5.44033 -0.654777 -0.384242
H  -5.553218 -0.487553 -2.144849
H  -0.700608 -3.764849 -0.54469
H  -2.460711 -3.617259 -0.687784
H  -1.638708 -3.24757 0.864792
H  1.973957 0.005862 2.53609
H  5.016899 -0.948521 -1.327844
H  2.293834 1.056008 -2.325755
H  3.357144 -0.257733 -2.906137
H  1.673354 -0.606343 -2.422504
H  4.271689 -0.85026 2.95017
H  5.806579 -1.33626 1.017537
