program: Gaussian 09
title: 000198998
version: EM64L-G09RevD.01
frameworkgroup: C1[X(C21H22N4)]
method: RPBEPBE
basis: SDD
operation: Freq
keyword: #pfreq=noraman
keyword: PBEPBE/SDD
title: #p freq=noraman PBEPBE/SDD
converged: NO YES NO NO
title: Mulliken charges:
elementType: N N N N C C C C C C C C C C C C C C C C C C C C C H H H H H H H H H H H H H H H H H H H H H H
charge: -0.149274 -0.114366 -0.091500 -0.091119 -0.352514 -0.357005 -0.316630 -0.405571 -0.406185 0.457464 0.450602 0.110541 -0.446658 -0.436283 -0.347480 -0.363020 -0.224274 -0.225516 -0.242493 -0.244933 -0.244750 -0.244643 -0.281877 -0.281916 -0.200022 0.239942 0.194449 0.196546 0.240237 0.199738 0.264211 0.215802 0.215651 0.264755 0.227162 0.225966 0.245040 0.254801 0.224036 0.223584 0.224572 0.224320 0.227788 0.227779 0.240503 0.240478 0.232061
chargesum: 0.00000
title: Mulliken charges with hydrogens summed into heavy atoms:
elementType: N N N N C C C C C C C C C C C C C C C C C C C C C
charge: -0.149274 -0.114366 -0.091500 -0.091119 0.081877 0.079778 -0.116892 0.074442 0.074222 0.457464 0.450602 0.110541 -0.219496 -0.210317 -0.102440 -0.108218 -0.000238 -0.001932 -0.017921 -0.020613 -0.016963 -0.016864 -0.041375 -0.041438 0.032039
polarizability: 3.08935478e+02 8.89976301e-01 2.56437914e+02 -7.63887249e+00 -1.94733898e+00 1.92450927e+02
1716.lowfreq: -15.9459 -10.5179 -6.9734 -3.5926 -0.0005 0.0002 0.0003 18.6479 41.6128
frequency: -9.7047 18.3630 41.5155 47.0914 51.5872 59.8300 80.6825 88.1316 136.3406 139.8950 186.9928 208.9489 217.6792 253.7846 262.4033 269.7264 316.5934 329.3240 378.8570 402.1350 407.3827 408.3097 423.1907 457.1541 478.8537 491.9726 508.8492 514.0579 575.4916 604.7164 614.0607 617.6961 626.9086 627.4299 644.5003 699.7674 711.3927 730.2498 754.7409 759.6690 778.1660 791.4289 805.7096 829.8331 842.4437 846.7993 852.3482 860.5804 919.2732 921.0705 935.7851 953.5074 960.4123 962.3962 962.9597 976.4539 983.6686 989.7187 990.8519 994.1849 995.7798 1001.6039 1024.7782 1026.2063 1045.2101 1053.4320 1064.0949 1072.5515 1075.7840 1078.4682 1105.1788 1120.4425 1135.8149 1170.1837 1171.3289 1178.7053 1183.5031 1183.7102 1188.8353 1193.8584 1205.7400 1227.7937 1259.4719 1261.5733 1276.0966 1290.2015 1297.6498 1302.8248 1330.9322 1333.3614 1333.9020 1348.5644 1356.0787 1376.4855 1383.2091 1384.3497 1391.8595 1405.8273 1439.3988 1440.9101 1461.3972 1463.5432 1464.4665 1475.2095 1476.8383 1480.5641 1505.4871 1521.4933 1570.9114 1592.6160 1594.8740 1608.1581 1612.8185 2829.7829 2862.6563 2872.0257 2970.1083 2973.7949 3065.1194 3069.8036 3102.2849 3103.1867 3112.4434 3114.4333 3122.5977 3124.5308 3124.9295 3125.5697 3135.4580 3137.7232 3145.7589 3149.8257 3161.9732 3163.3943 3187.2417
redmass: 3.9452 4.9385 4.2389 4.7357 5.1356 4.5194 4.3242 4.1669 5.7161 3.7298 4.0443 4.5928 5.4367 4.2826 3.9783 2.3448 2.5096 3.8524 4.1613 2.8008 4.2131 2.8445 2.1693 2.9096 3.2183 4.4088 3.7246 2.8751 4.9930 5.4224 5.0124 6.1352 7.8047 2.8385 3.4443 1.8524 1.7078 4.9594 1.7722 2.3800 1.8593 2.5384 4.2819 3.0144 1.9270 2.1928 1.3644 1.2598 1.6114 3.7267 1.5803 1.3716 2.2267 3.5818 1.4911 1.3966 1.4027 6.1309 4.2783 1.9345 1.6551 1.4620 2.1064 2.2296 2.7004 1.7329 2.2657 1.6123 1.6349 1.8404 2.2769 2.3165 4.6183 1.0715 1.0723 1.2221 1.5355 1.8479 1.7994 1.5116 1.4986 2.0502 1.3357 2.6883 1.7789 1.2590 1.3964 1.9735 1.2936 1.2497 1.2781 1.3616 1.3868 2.2225 6.3382 1.7945 2.4714 1.8630 2.1060 2.1529 1.0842 1.0778 1.1262 1.1172 2.2361 2.2799 5.6145 4.4238 5.7200 6.0389 6.2069 6.1652 6.1567 1.0812 1.0717 1.0702 1.0685 1.0691 1.0883 1.0891 1.0925 1.0941 1.0873 1.0870 1.0858 1.0863 1.0902 1.0927 1.0910 1.0916 1.0957 1.0950 1.1014 1.1012 1.0981
irintensity: 0.1838 0.0956 0.0248 0.0400 0.0203 0.4527 0.3425 0.1509 6.8469 0.3178 2.5812 1.3880 0.7480 0.6795 1.1836 2.5966 8.6133 0.1186 3.4600 0.0944 0.0004 0.2419 0.7349 0.7416 4.1869 10.1736 14.0715 2.7385 8.6506 8.9546 0.7338 3.6822 3.5907 3.9046 11.3197 24.7096 86.5901 4.4033 39.2563 29.8305 13.2063 51.8995 26.8758 3.8511 0.0567 0.2917 0.1196 0.3297 2.0809 1.7837 8.4929 0.0001 1.8548 105.6795 5.1561 0.0408 2.3419 0.3766 11.9371 39.3098 25.0819 5.5733 12.6940 1.5780 4.4163 1.0460 3.0700 0.8984 0.1420 29.0555 5.6073 21.7188 25.8651 0.5396 0.7943 1.5341 9.2293 1.6327 5.4740 0.3370 0.2063 4.2225 125.1930 1.6245 8.2546 4.1459 19.0470 38.2662 1.1554 0.5490 6.5161 2.8517 91.2645 6.2634 0.1353 65.9194 13.5343 0.0047 1.2674 23.6143 7.2418 5.4555 78.9247 3.1824 26.9379 8.5829 79.1019 229.2427 683.0630 0.1017 2.0794 11.9733 1.4345 41.0142 33.8358 112.6398 16.7371 101.0860 26.9400 19.1139 3.4157 8.1427 7.5265 8.2808 0.4517 0.2671 29.2437 31.2758 11.5899 30.5891 13.3347 45.6401 34.6802 20.4969 18.8507
temp: 298.150 k
press: 1.00000 atm
elementType: 7 7 7 7 6 6 6 6 6 6 6 6 6 6 6 6 6 6 6 6 6 6 6 6 6 1 1 1 1 1 1 1 1 1 1 1 1 1 1 1 1 1 1 1 1 1 1
symmnumber: 1
zpe: 1013850.6 jmol-1
zpe.correction: 0.386155 hartree
zpe.thermalcorrener: 0.406058 hartree
zpe.thermalcorrenthalpy: 0.407002 hartree
zpe.thermalcorrgfe: 0.336026 hartree
zpe.sumelectzpe: -1030.642500 hartree
zpe.sumelectthermal: -1030.622597 hartree
zpe.sumelectthermalent: -1030.621653 hartree
zpe.sumelectthermalfe: -1030.692629 hartree
dipole: -0.4408 0.0904 -0.6807
dipole: 0.8160
quadrupole: -137.4784 -141.5683 -138.7729
quadrupole: -0.1026 -0.9003 -0.6365
quadrupole: 1.7948 -2.2951 0.5003 -0.1026 -0.9003 -0.6365
hfenergy: -1031.0286552 hartree
pointgroup: C01 [X(C21H22N4)]
dipole: -0.1688576 0.0080354 -0.2729136 debye
polarizability: 309.1124533|1.8488153|255.709166|-5.4038092|-7.4765863|193.0026998 unknown
InChI: InChI=1S/C21H22N4/c1-3-8-18(9-4-1)20(19-10-5-2-6-11-19)24-14-16-25(17-15-24)21-22-12-7-13-23-21/h1-13,20H,14-17H2
charge 0 multiplicity 1
47 atoms
N  -0.199521 -0.022717 0.0871
N  2.647666 0.080763 0.528112
N  4.652817 -1.110925 0.153999
N  4.585202 1.343026 0.044198
C  0.581436 1.200262 -0.24989
C  0.654293 -1.224431 -0.135448
C  -1.494919 -0.101733 -0.656581
C  1.833854 1.305139 0.64044
C  1.906591 -1.172486 0.758306
C  -2.343406 1.163263 -0.440671
C  -2.309387 -1.338708 -0.239684
C  3.993391 0.105014 0.235466
C  -2.958324 1.802406 -1.543432
C  -3.062564 -2.042568 -1.209722
C  -2.561282 1.68414 0.860469
C  -2.373737 -1.758779 1.113068
C  -3.782421 2.936273 -1.355093
C  -3.873736 -3.139381 -0.839514
C  -3.377275 2.819075 1.051719
C  -3.177623 -2.857427 1.485568
C  -3.995355 3.448472 -0.055511
C  -3.935153 -3.550395 0.511512
C  5.913064 1.338647 -0.238796
C  5.978981 -1.059197 -0.131918
C  6.679353 0.15295 -0.340441
H  -0.047412 2.090666 -0.086019
H  0.895073 1.193842 -1.324428
H  0.971006 -1.297732 -1.206565
H  0.076626 -2.131161 0.109065
H  -1.304379 -0.185404 -1.758799
H  2.458735 2.162354 0.348062
H  1.515053 1.434772 1.695218
H  1.592744 -1.220159 1.821392
H  2.580935 -2.01564 0.54617
H  -2.790448 1.413909 -2.555919
H  -3.017854 -1.728847 -2.260444
H  -2.074609 1.201307 1.714851
H  -1.774852 -1.226636 1.860693
H  -4.251449 3.420104 -2.219374
H  -4.451857 -3.673041 -1.602459
H  -3.534412 3.212773 2.062522
H  -3.215401 -3.173723 2.534388
H  -4.631706 4.32803 0.093638
H  -4.561624 -4.401522 0.80129
H  6.369818 2.32442 -0.387935
H  6.489196 -2.027921 -0.194268
H  7.747374 0.172127 -0.566936
