program: Gaussian 09
title: 000198976
version: EM64L-G09RevD.01
frameworkgroup: C1[X(C8Cl9N)]
method: RPBEPBE
basis: SDD
operation: Freq
keyword: #pfreq=noraman
keyword: PBEPBE/SDD
title: #p freq=noraman PBEPBE/SDD
converged: YES YES NO NO
title: Mulliken charges:
elementType: Cl Cl Cl Cl Cl Cl Cl Cl Cl N C C C C C C C C
charge: 0.058778 0.061995 0.067180 0.066846 0.073258 0.039064 0.159559 0.145651 0.146329 0.079966 0.708109 -0.327550 -0.349629 -0.073991 -0.073759 -0.133107 0.011321 -0.660020
chargesum: 0.00000
title: Mulliken charges with hydrogens summed into heavy atoms:
polarizability: 2.52844884e+02 -2.45218237e+00 2.06618835e+02 4.97763703e+00 -1.39750335e+00 1.14758454e+02
1716.lowfreq: -2.0162 -0.0026 -0.0010 0.0024 2.6677 4.1721 11.6408 24.0738 31.0872
frequency: 11.0797 23.9339 31.0728 46.6492 66.3153 72.6444 94.2865 123.0122 154.2863 162.2945 171.2164 200.5169 202.5878 212.4559 214.7354 223.1889 253.4870 295.5154 305.3114 318.0404 322.9516 326.7413 353.6801 363.5847 367.7212 474.0667 508.8309 544.8194 585.3921 617.9622 627.6371 660.4913 682.6813 706.0845 710.7134 764.5849 775.1075 824.3299 908.6380 1028.6974 1084.9425 1234.9513 1315.6881 1345.4587 1363.6740 1518.0406 1549.5931 1754.1563
redmass: 32.8902 32.8831 29.7742 27.7770 33.9805 31.3923 30.9823 31.1113 30.8590 23.4101 18.1371 33.2049 32.2746 27.0519 34.6150 30.2789 28.3932 30.3101 27.5142 12.6885 14.1133 28.6062 30.9017 22.2238 19.2026 16.8887 14.9670 13.4480 12.0963 13.8003 12.7025 13.2961 13.6861 13.6260 12.5529 12.6364 12.0494 12.9520 12.5731 12.1702 12.2561 12.2019 12.0454 12.0154 12.0521 12.0032 12.0028 12.9158
irintensity: 0.0540 0.0702 0.0046 0.0708 0.0306 0.0255 0.1128 0.3725 0.0629 0.3892 0.1668 0.1175 0.0719 0.1522 0.0067 0.1421 0.0011 0.9312 0.0686 0.5333 3.4469 0.0842 1.5491 0.8180 1.3697 30.3855 30.2403 17.5129 0.5826 14.8596 15.6672 79.2491 33.3305 151.5832 153.3651 54.6005 5.5422 0.1496 12.0341 51.7797 5.4527 21.6290 117.5880 34.1680 187.3595 2.4357 8.3565 429.1444
temp: 298.150 k
press: 1.00000 atm
elementType: 17 17 17 17 17 17 17 17 17 7 6 6 6 6 6 6 6 6
symmnumber: 1
zpe: 158528.2 jmol-1
zpe.correction: 0.060380 hartree
zpe.thermalcorrener: 0.079896 hartree
zpe.thermalcorrenthalpy: 0.080840 hartree
zpe.thermalcorrgfe: 0.007340 hartree
zpe.sumelectzpe: -4498.784218 hartree
zpe.sumelectthermal: -4498.764702 hartree
zpe.sumelectthermalent: -4498.763758 hartree
zpe.sumelectthermalfe: -4498.837259 hartree
dipole: -0.0582 -0.0105 0.0545
dipole: 0.0804
quadrupole: -166.1047 -163.1572 -164.2550
quadrupole: -0.0731 0.1552 0.4440
quadrupole: -1.5991 1.3484 0.2507 -0.0731 0.1552 0.4440
hfenergy: -4498.8445986 hartree
pointgroup: C01 [X(C8Cl9N1)]
dipole: 0.0235591 0.0018073 0.021033 debye
dipolederiv: -0.1907148 0.2836247 -0.0182972 0.2493109 -0.4371476 0.0132099 -0.0153885 -0.0030005 0.0258506 -0.1751983 -0.2584836 -0.0308484 -0.2285836 -0.477849 -0.0631394 -0.0363543 -0.0417377 0.0188528 -0.2098121 0.2829524 0.0236854 0.3292477 -0.4700275 -0.0311029 0.0108019 -0.0091527 0.0190334 -0.1791635 -0.2599508 -0.0081441 -0.3179609 -0.4919641 -0.0255332 -0.0349303 -0.0439233 0.0176 -0.7339565 -0.0110822 -0.0090385 -0.017364 0.0021756 -0.0009015 -0.0431095 -0.0025425 0.0221764 -0.2074642 -0.0189934 -0.1534242 0.0987641 -0.0223708 -0.1373054 0.3369993 -0.108966 -0.8730201 -0.1635458 -0.0104376 -0.062693 -0.0132906 -0.1111533 -0.0903047 -0.0426873 -0.0832947 -0.6536271 -0.3304814 0.221314 0.0459423 0.2172957 -0.5652387 -0.1202325 0.0398918 -0.1195884 -0.1427414 -0.3569224 -0.2060244 0.1304648 -0.2128275 -0.4370228 0.234032 0.1327462 0.2293142 -0.2698332 -1.6581114 0.0434746 0.3101224 -0.0483099 -0.1440484 -0.0926204 0.2217436 -0.0729637 -0.727961 1.1800621 -0.0304428 -0.1981634 0.0117813 -0.1690137 -0.0117774 0.0444572 -0.0145325 0.1860823 0.0138476 -0.4098319 0.0702323 -0.5376168 0.541298 -0.0580304 0.0750434 0.0082982 -0.0728133 0.0092991 0.4018053 0.0950242 0.5546208 0.5875156 0.0977286 -0.0482889 0.048535 -0.0484385 0.1132761 -0.4792618 -0.0356813 -0.6130457 0.6425715 0.0285633 -0.0050909 0.0123176 -0.0125118 0.0608284 0.4363179 0.0134467 0.5719061 0.6857792 0.0574872 0.0400809 0.0632346 -0.0040934 0.9354028 0.0296485 0.0433549 0.0303956 -0.3163424 -0.0150047 0.0589248 -0.0133834 -0.0418737 1.0194804 -0.0156106 -0.1204235 -0.0736472 -0.0678472 0.2623587 -0.6527819 0.196912 1.4847542 0.8731741 0.0009815 -0.0955593 -0.0006757 1.2506854 -0.0474271 -0.0820575 -0.0455262 1.0725638 unknown
polarizability: 252.3587285|-2.2533067|205.5830668|-9.1790973|10.191893|116.2803779 unknown
InChI: InChI=1S/C8Cl9N/c9-1-2(10)4(12)6(5(13)3(1)11)18-7(14)8(15,16)17
charge 0 multiplicity 1
18 atoms
Cl -0.040632 2.702882 -0.110092
Cl 0.097244 -2.811687 -0.434646
Cl 3.324012 -2.763998 -0.217354
Cl 3.173954 2.79054 0.119462
Cl 4.859415 0.051433 0.056182
Cl -1.882003 0.326939 2.198257
Cl -3.765188 -0.312996 -1.853348
Cl -4.389115 1.615861 0.379988
Cl -4.440006 -1.379967 0.885185
N  -1.158685 -0.108466 -0.443824
C  0.231156 -0.057286 -0.24135
C  0.917278 1.179792 -0.1185
C  0.987441 -1.257226 -0.279363
C  2.394183 -1.229146 -0.182322
C  2.325837 1.215053 -0.030234
C  3.068362 0.009994 -0.058337
C  -2.115314 0.038574 0.373703
C  -3.587941 -0.010496 -0.043306
