program: Gaussian 09
title: 000198962
version: EM64L-G09RevD.01
frameworkgroup: C1[X(C12H15Cl2NO2)]
method: RPBEPBE
basis: SDD
operation: Freq
keyword: #p
keyword: freq=noraman
keyword: PBEPBE/SDD
title: #p freq=noraman PBEPBE/SDD
converged: YES YES NO NO
title: Mulliken charges:
elementType: Cl Cl O O N C C C C C C C C C C C C H H H H H H H H H H H H H H H
charge: 0.026417 0.074104 -0.421010 -0.235280 -0.115373 -0.582073 -0.419549 0.516645 -0.303770 0.389920 -0.433469 -0.365686 0.440124 -0.416596 -0.356384 -0.737120 -0.804298 0.281437 0.220835 0.240538 0.268634 0.227593 0.190670 0.231300 0.260919 0.231492 0.232207 0.326529 0.231119 0.223986 0.234127 0.342011
chargesum: 0.00000
title: Mulliken charges with hydrogens summed into heavy atoms:
elementType: Cl Cl O O N C C C C C C C C C C C C
charge: 0.026417 0.074104 -0.078999 -0.235280 -0.115373 -0.079800 0.089623 0.516645 0.114494 0.389920 -0.202169 -0.104766 0.440124 -0.185103 -0.124177 -0.410591 -0.115067
polarizability: 2.00753399e+02 -8.11534712e+00 1.56804099e+02 -2.30013796e+01 -6.41759672e+00 1.25040551e+02
1716.lowfreq: -8.4103 -2.7063 -0.0022 -0.0006 0.0009 6.2878 17.0414 26.8307 30.0684
frequency: 15.0442 26.5775 30.0197 34.6585 45.5479 58.5527 65.0111 117.5274 122.4671 156.3474 177.5533 193.4254 241.0854 247.4660 299.5991 302.3129 318.5052 334.3829 339.4207 376.4217 405.1915 411.5196 462.7057 474.7281 567.5988 590.0492 636.3790 637.7918 711.4011 732.6917 753.4520 756.6549 792.1634 808.8061 818.6686 839.1363 856.0740 924.0893 958.4661 967.1361 976.6676 981.2204 995.3342 1015.7895 1029.0915 1048.8055 1061.5156 1119.5937 1126.0415 1158.6716 1189.7437 1193.4475 1212.8017 1222.7633 1229.5060 1260.2205 1276.8360 1302.4890 1315.3760 1345.0606 1354.9163 1376.4065 1386.2706 1397.0241 1399.1575 1410.5405 1460.0757 1470.5977 1474.8299 1475.7450 1500.3508 1508.8107 1586.5826 1603.8127 1625.0423 2956.4783 2977.5945 3006.1236 3010.8991 3056.3439 3063.6826 3076.4334 3085.0201 3088.4861 3109.8636 3119.5890 3129.3754 3136.0351 3145.7469 3566.4940
redmass: 4.4979 3.4507 1.5048 3.2051 10.8416 7.5621 6.0167 2.1162 4.6931 4.9257 6.1393 7.0924 6.0842 5.4413 1.4527 4.5356 3.1880 3.3965 3.6588 3.7757 2.8466 2.4198 4.6063 2.9847 6.7604 4.8483 5.7550 6.0934 3.5878 6.3953 5.1131 3.6591 2.5525 1.4925 3.0879 2.0626 1.2656 2.1613 1.5211 2.9343 2.1353 1.3724 1.7505 2.7620 4.2592 1.5596 1.6643 1.5008 1.3674 1.5765 1.2958 1.1155 2.9002 2.6483 1.6071 1.4752 1.2909 1.1862 1.2900 1.3153 1.3193 3.7455 1.2597 1.4666 2.1912 2.4275 1.1034 1.0464 1.1021 1.0870 1.0989 2.6055 5.9920 8.3858 6.3171 1.0697 1.0372 1.0622 1.0617 1.0975 1.0991 1.1002 1.0990 1.0985 1.0877 1.0881 1.0881 1.0959 1.0972 1.0665
irintensity: 0.2876 0.6565 0.7306 0.2917 0.7570 3.5066 1.2640 7.7002 1.0732 0.4040 4.9382 6.7624 4.2158 2.0573 107.2844 12.7433 0.9843 5.5104 52.1316 0.8320 0.2886 6.3472 5.8452 16.3598 43.3416 47.7597 12.6791 1.0961 7.1273 7.5190 103.5260 7.3703 9.3938 8.5798 12.0844 26.4818 1.5069 19.3536 1.6900 121.4104 12.9971 0.4908 3.1872 4.4677 11.7827 13.1593 17.6229 30.6455 79.4142 14.8137 21.3168 2.6311 2.0195 5.2097 26.6953 30.1841 4.3719 3.3996 5.8649 3.8369 20.3030 23.5354 2.8007 17.3014 32.3263 1.5020 27.4600 14.0569 16.1905 6.2310 5.5684 26.3495 0.4965 232.3704 4.7933 57.9843 34.5152 30.3995 16.1999 19.9108 2.4077 8.6003 18.9022 26.1053 13.5959 13.7582 8.5507 29.7933 2.2094 10.8137
temp: 298.150 k
press: 1.00000 atm
elementType: 17 17 8 8 7 6 6 6 6 6 6 6 6 6 6 6 6 1 1 1 1 1 1 1 1 1 1 1 1 1 1 1
symmnumber: 1
zpe: 653316.2 jmol-1
zpe.correction: 0.248835 hartree
zpe.thermalcorrener: 0.267326 hartree
zpe.thermalcorrenthalpy: 0.268270 hartree
zpe.thermalcorrgfe: 0.197630 hartree
zpe.sumelectzpe: -1590.296837 hartree
zpe.sumelectthermal: -1590.278346 hartree
zpe.sumelectthermalent: -1590.277402 hartree
zpe.sumelectthermalfe: -1590.348043 hartree
dipole: -2.0332 2.7989 1.9848
dipole: 3.9884
quadrupole: -106.7600 -123.1729 -116.3038
quadrupole: 10.4153 2.3514 -4.4651
quadrupole: 8.6523 -7.7607 -0.8916 10.4153 2.3514 -4.4651
hfenergy: -1590.5456723 hartree
pointgroup: C01 [X(C12H15Cl2N1O2)]
dipole: -0.5267896 1.2078856 0.8518981 debye
polarizability: 193.8592805|-15.2517461|162.0190888|-26.8461176|0.576726|126.7196799 unknown
InChI: InChI=1S/C12H15Cl2NO2/c1-9-2-4-10(5-3-9)8-15(6-7-16)12(17)11(13)14/h2-5,11,16H,6-8H2,1H3
charge 0 multiplicity 1
32 atoms
Cl 2.356124 -2.117436 1.666994
Cl 4.319477 -2.33554 -0.676395
O  2.562232 3.314694 1.112103
O  1.569854 -1.782287 -1.768208
N  1.203924 0.212199 -0.608614
C  0.048642 0.543154 -1.496545
C  1.481743 1.159597 0.492233
C  -1.294604 0.351873 -0.804356
C  2.48094 2.27285 0.084795
C  1.8786 -0.978139 -0.842985
C  -2.156821 1.447807 -0.5676
C  -1.704799 -0.940375 -0.382586
C  -3.819496 -0.025315 0.49737
C  -3.404165 1.260624 0.073573
C  -2.946227 -1.121802 0.257383
C  3.048783 -1.274279 0.123508
C  -5.15856 -0.237331 1.182209
H  0.137937 -0.117421 -2.375724
H  0.16081 1.591219 -1.831895
H  1.836583 0.622548 1.390962
H  0.527408 1.636671 0.778178
H  2.121274 2.79665 -0.815872
H  3.480957 1.844374 -0.143875
H  -1.859037 2.45402 -0.890186
H  -1.049843 -1.800232 -0.566084
H  -4.059672 2.122584 0.246432
H  -3.248924 -2.12757 0.574381
H  3.576399 -0.388313 0.49495
H  -5.03406 -0.727384 2.165852
H  -5.68662 0.717824 1.345091
H  -5.818643 -0.887999 0.577832
H  2.997883 2.952535 1.924383
