program: Gaussian 09
title: 000198981
version: EM64L-G09RevD.01
frameworkgroup: C1[X(C17H20N4O2)]
method: RPBEPBE
basis: SDD
operation: Freq
keyword: #p
keyword: freq=noraman
keyword: PBEPBE/SDD
title: #p freq=noraman PBEPBE/SDD
converged: YES YES NO NO
title: Mulliken charges:
elementType: O O N N N N C C C C C C C C C C C C C C C C C H H H H H H H H H H H H H H H H H H H H
charge: -0.270149 -0.265992 -0.138331 -0.117475 -0.090467 -0.091115 0.024576 -0.409121 -0.360086 -0.397426 -0.499159 -0.761756 0.512308 0.104095 -0.486249 -0.464852 0.203584 0.155685 -0.325564 -0.202344 -0.283956 -0.282588 -0.199335 0.196829 0.211020 0.260774 0.232212 0.198347 0.263966 0.219125 0.232782 0.197700 0.225985 0.227668 0.221921 0.286694 0.237289 0.248953 0.235851 0.235071 0.240840 0.240427 0.232260
chargesum: 0.00000
title: Mulliken charges with hydrogens summed into heavy atoms:
elementType: O O N N N N C C C C C C C C C C C C C C C C C
charge: -0.270149 -0.265992 -0.138331 -0.117475 -0.090467 -0.091115 0.221405 0.062673 0.070473 0.085665 -0.068677 -0.086181 0.512308 0.104095 -0.199555 -0.227563 0.203584 0.155685 -0.076611 0.268577 -0.043115 -0.042161 0.032924
polarizability: 3.15528611e+02 1.22498007e+01 1.85709297e+02 9.89722831e+00 -1.26124944e+00 1.66841035e+02
1716.lowfreq: -64.9780 -7.4206 -0.0007 -0.0005 -0.0002 1.9988 7.0165 14.7901 26.4166
frequency: -64.9732 14.1648 26.3855 31.2047 48.4758 71.6525 95.9972 124.6309 138.2684 166.1469 192.0806 213.4861 220.9035 241.3821 275.9050 295.0425 312.2945 325.9892 366.6437 373.3954 407.1312 421.0861 427.3929 444.8222 476.0286 503.7339 513.4073 532.0786 547.8542 590.5291 604.8987 627.0954 633.7456 678.4680 714.5215 740.4437 751.4501 755.6396 777.9677 778.1370 790.9952 812.2245 842.0740 860.3433 893.4495 897.2225 916.0952 922.7155 930.4806 942.0423 953.1874 962.4665 963.8566 978.5681 984.8194 1027.9147 1054.3628 1055.7522 1064.6781 1065.0431 1073.2556 1081.6277 1090.2368 1119.3530 1125.4859 1128.8276 1141.3140 1160.7017 1168.6002 1187.9505 1211.2433 1235.8294 1247.3699 1250.0546 1266.7765 1268.5709 1282.3595 1293.7461 1307.8695 1326.7233 1341.5512 1353.5563 1359.7010 1365.4118 1374.2533 1383.7199 1389.5399 1405.5793 1408.2072 1439.9629 1454.8970 1462.1717 1463.2195 1466.1107 1473.3405 1479.9334 1486.6114 1490.3499 1505.5472 1521.6279 1570.9843 1610.7906 1630.5107 2841.4004 2852.8652 2867.2055 2961.5753 2974.8723 2986.3129 3009.0977 3034.8143 3050.1617 3080.0900 3085.7013 3088.4454 3101.4192 3103.8108 3124.4674 3125.8809 3133.3522 3174.3092 3179.4273 3187.3190
redmass: 2.3203 5.3069 5.4042 4.8005 5.4916 4.1256 3.9677 4.4923 6.0106 3.3443 1.8509 2.9600 5.5805 2.3461 2.3578 2.7920 3.3582 3.2821 2.8185 3.4080 4.1959 3.0455 3.5748 3.1571 2.5891 4.8989 2.8423 4.4219 3.6776 4.7630 5.2310 7.0841 3.3060 9.5259 4.7839 3.4476 4.7838 4.3148 2.6014 2.7352 2.5775 1.4182 10.1579 2.2163 1.4085 1.4836 3.1033 3.4831 1.3667 2.7295 1.3719 1.5004 2.3258 5.0876 2.2749 2.0887 2.5608 3.4442 1.4638 1.8106 1.9178 2.2701 2.5253 1.0369 2.0688 1.5929 3.1570 1.8368 1.7213 2.4547 1.3933 1.3109 2.4890 4.8052 1.7410 1.3895 1.4106 1.6410 1.6859 1.3047 1.3330 1.5281 1.4634 1.2898 1.6306 1.6249 1.2526 1.8970 2.5650 4.6450 1.0940 1.1995 1.1164 1.1006 1.5501 1.2684 1.2485 1.0514 5.6307 4.5329 5.7840 7.9619 8.3091 1.0806 1.0728 1.0708 1.0688 1.0685 1.0364 1.0534 1.0848 1.0889 1.0986 1.1188 1.0994 1.0928 1.0939 1.0908 1.0920 1.0898 1.0927 1.0953 1.0981
irintensity: 14.5767 0.0568 0.1394 0.2544 0.3068 0.3566 0.5949 3.4749 3.9453 0.4604 0.1919 0.4420 0.1501 1.8221 1.0683 5.2585 3.2427 6.6151 6.6425 3.8448 0.0050 9.5822 1.4587 0.0856 3.4451 2.8833 3.5714 12.3981 6.2640 2.5775 2.5756 3.1014 1.6604 1.0451 1.9391 3.7959 4.4002 10.7347 15.5179 15.9452 51.0755 50.3938 30.0706 8.6733 17.5933 5.1786 8.6488 2.3266 2.6250 34.7551 0.0062 0.1281 7.4613 139.8810 75.0313 38.0495 10.1205 15.6109 4.6301 2.4780 10.3781 28.0024 9.2888 0.0123 11.1016 1.7975 22.7734 39.3942 16.6785 5.2450 0.5723 12.6962 58.3633 204.3120 14.2171 87.0093 16.9824 7.6849 23.9435 36.5771 12.6987 14.9404 56.6173 3.1451 7.6038 91.1968 21.4855 0.2872 7.1298 54.2951 25.9693 53.2780 44.2223 10.5493 89.3322 29.4660 21.5636 18.8192 78.2783 219.6136 661.7745 4.4715 0.2866 40.8994 51.6658 131.3867 51.5135 67.4243 27.7374 134.8057 17.3254 30.0223 39.2178 34.6566 29.5535 6.7474 6.0863 29.6395 29.8080 10.3279 1.9898 6.5824 18.3384
temp: 298.150 k
press: 1.00000 atm
elementType: 8 8 7 7 7 7 6 6 6 6 6 6 6 6 6 6 6 6 6 6 6 6 6 1 1 1 1 1 1 1 1 1 1 1 1 1 1 1 1 1 1 1 1
symmnumber: 1
zpe: 913628.6 jmol-1
zpe.correction: 0.347983 hartree
zpe.thermalcorrener: 0.367270 hartree
zpe.thermalcorrenthalpy: 0.368214 hartree
zpe.thermalcorrgfe: 0.297894 hartree
zpe.sumelectzpe: -1027.530796 hartree
zpe.sumelectthermal: -1027.511508 hartree
zpe.sumelectthermalent: -1027.510564 hartree
zpe.sumelectthermalfe: -1027.580884 hartree
dipole: 0.0211 0.5933 0.5506
dipole: 0.8097
quadrupole: -122.9734 -130.5560 -133.6140
quadrupole: 1.5824 5.6541 2.1567
quadrupole: 6.0744 -1.5082 -4.5662 1.5824 5.6541 2.1567
hfenergy: -1027.8787783 hartree
pointgroup: C01 [X(C17H20N4O2)]
dipole: 0.0055492 0.2654415 0.1760283 debye
polarizability: 315.2535258|14.1173177|184.8915163|9.4565812|-4.0299382|167.9339015 unknown
InChI: InChI=1S/C17H20N4O2/c1-13-10-21(17-18-5-2-6-19-17)8-7-20(13)11-14-3-4-15-16(9-14)23-12-22-15/h2-6,9,13H,7-8,10-12H2,1H3
charge 0 multiplicity 1
43 atoms
O  -4.583594 -1.245969 -1.604322
O  -6.057098 -1.143481 0.2936
N  -0.016104 1.067404 -0.083141
N  2.570009 -0.150921 -0.36469
N  4.067643 -1.639311 0.694148
N  4.871246 0.378368 -0.455003
C  1.167868 1.921236 -0.416905
C  2.228291 1.05052 -1.140488
C  0.381465 -0.097576 0.753713
C  1.41414 -0.975116 0.028992
C  -1.148098 1.803192 0.536915
C  0.802631 3.10485 -1.334676
C  -2.444308 0.995823 0.542142
C  3.866737 -0.477954 -0.033728
C  -2.800366 0.237105 -0.612702
C  -3.314429 1.044146 1.657678
C  -4.022904 -0.431422 -0.585879
C  -4.889609 -0.371828 0.527016
C  -4.56293 0.359414 1.669693
C  -5.897199 -1.701063 -1.076655
C  5.355032 -1.944094 0.999143
C  6.140248 0.027409 -0.12386
C  6.453848 -1.140866 0.610797
H  1.638387 2.314955 0.521831
H  1.81144 0.745987 -2.123871
H  3.152112 1.625189 -1.303781
H  -0.520225 -0.699021 0.964504
H  0.807121 0.235127 1.734333
H  1.773041 -1.789482 0.675835
H  0.949396 -1.410531 -0.879168
H  -1.314536 2.724838 -0.048525
H  -0.91476 2.125467 1.583721
H  1.724381 3.56897 -1.72997
H  0.197223 2.752238 -2.189744
H  0.241476 3.89684 -0.810023
H  -2.117181 0.183014 -1.464028
H  -3.021737 1.623563 2.540849
H  -5.231833 0.396816 2.533113
H  -5.898836 -2.803188 -1.017801
H  -6.70074 -1.304674 -1.721997
H  5.500827 -2.866008 1.574771
H  6.926184 0.7127 -0.463388
H  7.482338 -1.406266 0.863858
