program: Gaussian 09
title: 000198972
version: EM64L-G09RevD.01
frameworkgroup: C1[X(C12H16NO4PS)]
method: RPBEPBE
basis: SDD
operation: Freq
keyword: #p
keyword: freq=noraman
keyword: PBEPBE/SDD
title: #p freq=noraman PBEPBE/SDD
converged: NO YES NO NO
title: Mulliken charges:
elementType: S P O O O O N C C C C C C C C C C C C H H H H H H H H H H H H H H H H
charge: -0.231504 0.876507 -0.477711 -0.454228 -0.474189 -0.256601 -0.020100 0.231463 0.268287 -0.289384 -0.253219 -0.213743 -0.488622 -0.376713 0.434650 -0.658149 -0.654235 -0.535256 -0.262616 0.229098 0.231297 0.230352 0.230162 0.274469 0.271273 0.260743 0.206913 0.234446 0.273322 0.213299 0.231070 0.237166 0.234701 0.228212 0.248838
chargesum: 0.00000
title: Mulliken charges with hydrogens summed into heavy atoms:
elementType: S P O O O O N C C C C C C C C C C C C
charge: -0.231504 0.876507 -0.477711 -0.454228 -0.474189 -0.256601 -0.020100 0.231463 0.268287 -0.014915 0.207176 0.246771 -0.217349 -0.115969 0.434650 0.056532 0.027300 0.176494 -0.262616
polarizability: 2.62754143e+02 1.62887323e+01 2.05814312e+02 -1.13726430e+01 9.67831858e+00 1.39177796e+02
1716.lowfreq: -11.9124 -4.2349 -0.0024 -0.0019 -0.0017 7.1435 14.0973 15.3707 19.0026
frequency: 6.8523 14.4072 18.8589 32.7771 39.0340 49.9744 82.0915 87.8385 97.7662 107.3321 124.2215 156.2319 160.5085 174.1965 185.3963 228.2823 234.3663 241.4049 249.0013 277.9150 290.5202 292.0537 330.8322 366.3282 379.2569 406.3303 445.5720 469.8295 475.5811 490.1404 496.3536 520.9297 584.9685 616.3053 640.6352 681.7669 691.7408 702.9474 736.8190 802.2432 806.5110 810.4000 837.0820 861.1950 871.1009 876.5280 901.8875 959.2918 998.0167 1008.7247 1019.9897 1097.0161 1104.7432 1110.2662 1113.4009 1133.4124 1146.6099 1148.0019 1158.7211 1197.2871 1256.1660 1260.5585 1269.9538 1272.9970 1351.8315 1355.8547 1371.2760 1394.6729 1398.8112 1403.2776 1442.3268 1458.4708 1463.1002 1467.3223 1469.1858 1469.6545 1476.1686 1485.5365 1487.8122 1491.2210 1575.0933 1598.6630 2178.3439 2971.0387 2987.3673 2989.9370 2997.1183 2997.7143 3057.2048 3064.6605 3079.6639 3087.0910 3093.5440 3109.9403 3111.4246 3134.8301 3162.2850 3175.6065 3182.0305
redmass: 1.9965 4.0674 3.8588 5.2583 4.2633 4.0126 3.6265 4.6271 4.6363 5.7359 6.3446 2.9730 5.7609 2.9339 4.7740 1.9911 1.3903 1.3148 2.0965 4.2110 4.3380 3.3446 6.2278 6.0240 5.3915 5.4865 5.1367 4.3782 5.1498 7.1155 7.3990 7.5347 5.9921 9.8431 4.3061 7.6118 7.5177 6.7237 3.5266 6.5227 1.1337 1.0966 1.4460 3.8820 1.5971 4.1329 6.2587 1.3652 4.9882 2.7676 2.6503 2.1736 2.2790 2.4350 1.2599 1.4304 1.5314 1.7133 1.6224 1.9126 1.1414 2.4887 1.1279 1.9400 1.2178 1.2478 5.6125 1.2425 1.2381 3.3239 1.2823 1.0400 1.0556 1.0760 1.0915 1.0637 1.0573 1.0834 1.0548 2.5207 8.0117 6.2396 12.6313 1.0324 1.0368 1.0545 1.0394 1.0621 1.1079 1.1046 1.1016 1.0974 1.0981 1.1029 1.1024 1.1003 1.0889 1.0918 1.0978
irintensity: 1.1675 0.4117 0.4269 0.2690 0.8955 2.8007 3.7252 3.6658 3.9292 0.9931 4.5863 7.8793 0.4010 0.9802 7.1732 1.6476 1.2914 0.6434 2.7908 10.4970 6.0928 0.0864 10.6326 10.6270 3.1876 2.9009 19.6285 9.8175 3.5483 4.3023 3.1428 14.4405 3.6702 103.9220 6.5504 109.7762 18.7428 100.5079 5.4621 156.9182 4.8884 5.8682 34.3643 166.2542 54.3885 158.4200 2.5184 0.3001 45.0385 151.5726 106.9597 17.9407 36.9195 75.3281 0.0584 4.5387 5.4793 18.6796 17.2101 61.0361 0.4516 81.8428 2.4827 70.7726 11.3132 9.8103 15.0120 28.2845 14.9347 52.3951 12.6448 13.1259 11.0962 7.6347 52.7096 25.6246 7.8981 5.4897 14.6057 108.1421 27.8059 36.3068 51.2232 51.3338 18.5254 23.9878 24.9137 36.5124 11.4256 31.7140 4.9847 25.6679 27.7961 20.2913 32.9366 16.2577 2.1287 2.5187 0.3669
temp: 298.150 k
press: 1.00000 atm
elementType: 16 15 8 8 8 8 7 6 6 6 6 6 6 6 6 6 6 6 6 1 1 1 1 1 1 1 1 1 1 1 1 1 1 1 1
symmnumber: 1
zpe: 692336.1 jmol-1
zpe.correction: 0.263697 hartree
zpe.thermalcorrener: 0.286014 hartree
zpe.thermalcorrenthalpy: 0.286959 hartree
zpe.thermalcorrgfe: 0.206804 hartree
zpe.sumelectzpe: -1560.335723 hartree
zpe.sumelectthermal: -1560.313405 hartree
zpe.sumelectthermalent: -1560.312461 hartree
zpe.sumelectthermalfe: -1560.392616 hartree
dipole: 4.2059 2.4081 -0.1305
dipole: 4.8482
quadrupole: -147.0275 -103.2584 -135.6358
quadrupole: -16.4326 2.7531 2.6367
quadrupole: -18.3869 25.3821 -6.9952 -16.4326 2.7531 2.6367
hfenergy: -1560.5994197 hartree
pointgroup: C01 [X(C12H16N1O4P1S1)]
dipole: 1.77917 -0.666978 -0.1672789 debye
polarizability: 267.0747618|-5.3610878|200.2677976|-3.1089254|16.1285436|140.4036922 unknown
InChI: InChI=1S/C12H16NO4PS/c1-4-15-18(19,16-5-2)17-11-7-6-10(9-13)8-12(11)14-3/h6-8H,4-5H2,1-3H3
charge 0 multiplicity 1
35 atoms
S  1.81435 0.104389 -2.329526
P  2.237718 0.351127 -0.325131
O  1.058805 -0.182048 0.867218
O  3.652733 -0.404089 0.293332
O  2.449087 1.953389 0.27023
O  -0.365061 -2.293482 -0.094152
N  -5.738154 0.424156 0.207092
C  -0.324579 -0.023873 0.661621
C  -1.086641 -1.14097 0.202451
C  -0.95472 1.189058 0.99741
C  4.015878 -1.770658 -0.201111
C  3.357171 2.873005 -0.486654
C  -2.488073 -1.012609 0.087513
C  -2.352786 1.319736 0.883165
C  -3.119632 0.215941 0.426898
C  3.222929 -2.859475 0.523877
C  3.146582 4.260532 0.110277
C  -1.106622 -3.435905 -0.644337
C  -4.549764 0.330922 0.306405
H  3.859422 -1.804606 -1.297213
H  5.094871 -1.826887 0.017204
H  4.395882 2.518644 -0.353312
H  3.090121 2.836739 -1.560566
H  -0.331034 2.017539 1.346513
H  -3.102683 -1.845794 -0.262396
H  -2.848469 2.258715 1.143459
H  3.575353 -3.853243 0.187878
H  3.371483 -2.787462 1.614605
H  2.142137 -2.776967 0.315445
H  3.811866 4.986556 -0.392504
H  2.102889 4.590898 -0.024641
H  3.381105 4.261113 1.18798
H  -1.606715 -3.164302 -1.592829
H  -1.849893 -3.815446 0.082324
H  -0.343757 -4.204545 -0.832424
