program: Gaussian 09
title: 000198947
version: EM64L-G09RevD.01
frameworkgroup: C1[X(C14H17NO)]
method: RPBEPBE
basis: SDD
operation: Freq
keyword: #p
keyword: freq=noraman
keyword: PBEPBE/SDD
title: #p freq=noraman PBEPBE/SDD
converged: NO YES NO NO
title: Mulliken charges:
elementType: O N C C C C C C C C C C C C C C H H H H H H H H H H H H H H H H H
charge: -0.248324 -0.613000 0.098311 -0.565406 -0.524533 0.349267 0.177747 -0.357423 -0.406926 -0.024404 -0.024910 -0.249421 -0.249571 -0.243290 -0.602932 -0.607008 0.228927 0.254546 0.205354 0.231972 0.246005 0.254874 0.235293 0.224984 0.228863 0.227458 0.331356 0.328783 0.231279 0.215939 0.216972 0.217356 0.211863
chargesum: 0.00000
title: Mulliken charges with hydrogens summed into heavy atoms:
elementType: O N C C C C C C C C C C C C C C
charge: -0.248324 0.047138 0.098311 -0.081933 -0.087207 0.349267 0.177747 -0.111418 -0.152053 0.210889 0.200074 -0.020558 -0.022113 -0.012011 -0.170021 -0.177788
polarizability: 1.94374998e+02 3.21516673e+00 1.36668453e+02 -2.94474766e+00 2.79788167e+00 1.35540994e+02
1716.lowfreq: -10.0596 -5.9658 0.0000 0.0001 0.0005 8.1045 38.0351 42.5699 54.5736
frequency: 37.4745 42.4798 54.4541 66.1993 71.9322 79.8562 117.1931 131.7708 170.1845 201.2377 255.1875 271.6647 297.0285 328.5600 349.5004 384.8261 387.3406 402.9733 455.0388 492.8670 509.8170 548.7108 563.8201 591.8121 615.9444 631.6416 639.4125 704.6601 709.6490 746.4510 783.2552 823.2377 855.9913 876.2794 920.4712 925.0951 936.6548 939.2012 946.6805 972.4115 980.3103 989.9553 994.0569 997.7803 1006.2606 1024.3703 1032.4372 1050.1985 1072.8130 1095.6693 1129.5880 1147.7811 1174.4065 1187.5341 1199.2167 1235.5362 1247.9212 1285.2888 1287.3564 1300.3204 1302.9949 1322.1871 1331.0308 1375.9493 1425.5774 1427.0709 1433.9748 1453.7251 1460.3541 1483.6755 1580.4903 1587.2266 1609.9297 1632.6958 1656.4673 1659.3342 2964.5387 2990.3666 3033.2710 3068.4387 3080.9390 3085.8876 3092.9937 3108.0163 3117.4730 3126.8840 3140.1054 3152.8041 3165.4256 3192.5659 3196.8300 3511.4683 3666.5325
redmass: 3.2990 4.4407 4.1004 3.5984 3.2869 2.8690 4.1467 2.4444 3.1110 3.1361 3.5460 2.6016 3.9855 4.2453 3.0736 3.0837 2.6301 2.8256 2.2074 2.0734 1.1808 2.0688 1.3233 3.2014 5.6907 2.4612 1.7886 2.7559 2.0349 2.3456 2.5038 2.2199 1.2485 2.2361 1.4735 1.5678 1.6427 1.4226 1.4128 2.2571 1.4215 5.5629 1.2179 1.2836 1.1757 2.0707 2.1735 2.1803 2.1816 1.8327 2.2388 2.4663 1.0518 2.2016 1.1427 1.3459 1.4530 1.2734 1.3468 1.3519 1.5524 1.5612 2.0646 6.6386 1.1892 1.1868 2.1627 1.1318 1.0927 2.1046 1.8214 3.9061 5.7695 3.1835 4.7158 4.7072 1.0599 1.0660 1.0991 1.0899 1.0682 1.0606 1.0882 1.0934 1.0869 1.0865 1.0925 1.0946 1.1009 1.1144 1.1142 1.0444 1.1045
irintensity: 0.9417 7.4190 2.9522 0.2996 1.4863 0.2948 0.7319 0.3290 2.1584 1.0931 5.1331 1.6254 0.4337 1.6066 2.5114 2.9017 3.6274 0.1229 1.9989 5.5154 149.6737 8.5094 61.2483 13.9026 1.2055 12.8897 42.6572 15.0116 39.2216 32.5723 7.7500 7.5779 0.6374 9.6801 2.3323 13.3062 19.0103 61.3744 76.0372 4.0259 0.0912 0.2374 8.6719 1.1960 10.2935 4.5358 9.7961 2.6116 4.5931 5.7847 8.8486 8.0183 0.1219 1.4797 0.8923 12.1688 7.0015 3.3288 5.6273 1.7412 28.4707 23.0831 56.1999 1.0997 4.6279 7.9355 8.6501 6.7756 22.5548 23.0468 84.2116 7.3852 21.2621 246.1140 11.6862 17.0917 18.3230 12.1341 16.1819 2.0042 23.6135 14.6741 8.1105 10.8494 6.0907 0.3092 19.3158 32.4934 18.1331 26.0020 26.7058 27.2381 30.0591
temp: 298.150 k
press: 1.00000 atm
elementType: 8 7 6 6 6 6 6 6 6 6 6 6 6 6 6 6 1 1 1 1 1 1 1 1 1 1 1 1 1 1 1 1 1
symmnumber: 1
zpe: 716054.7 jmol-1
zpe.correction: 0.272731 hartree
zpe.thermalcorrener: 0.289211 hartree
zpe.thermalcorrenthalpy: 0.290156 hartree
zpe.thermalcorrgfe: 0.227791 hartree
zpe.sumelectzpe: -672.452017 hartree
zpe.sumelectthermal: -672.435537 hartree
zpe.sumelectthermalent: -672.434593 hartree
zpe.sumelectthermalfe: -672.496957 hartree
dipole: -2.8429 -0.8979 2.5538
dipole: 3.9256
quadrupole: -93.1247 -90.4751 -98.8254
quadrupole: 3.8322 3.6261 -2.1290
quadrupole: 1.0170 3.6666 -4.6837 3.8322 3.6261 -2.1290
hfenergy: -672.7247482 hartree
pointgroup: C01 [X(C14H17N1O1)]
dipole: 0.9891033 0.3317975 1.1388133 debye
polarizability: 192.0948909|8.5323803|138.4657523|8.9314416|-1.4335647|136.0238018 unknown
InChI: InChI=1S/C14H17NO/c1-3-10-14(11-4-2,13(15)16)12-8-6-5-7-9-12/h3-9H,1-2,10-11,15H2
charge 0 multiplicity 1
33 atoms
O  -1.768673 1.470275 -1.804735
N  -0.724425 2.51761 -0.025836
C  -0.515642 0.040674 -0.196034
C  -0.639542 -1.03368 -1.337083
C  -1.435481 -0.341348 1.020282
C  0.966774 0.173224 0.221437
C  -1.046135 1.396476 -0.767889
C  1.895245 0.727795 -0.704128
C  1.463844 -0.275585 1.472026
C  -0.234713 -2.427396 -0.911581
C  -2.91919 -0.322619 0.7209
C  3.266056 0.83156 -0.392191
C  2.83925 -0.172709 1.789187
C  3.747038 0.380029 0.860095
C  -1.018033 -3.530246 -1.023771
C  -3.837823 0.370473 1.438133
H  0.003058 -0.703574 -2.176968
H  -1.670786 -1.021385 -1.726988
H  -1.230587 0.336458 1.87088
H  -1.150657 -1.36661 1.334193
H  1.536674 1.08783 -1.676582
H  0.786051 -0.715464 2.209745
H  0.783841 -2.536588 -0.507915
H  -3.258837 -0.933679 -0.127133
H  3.959022 1.264314 -1.122521
H  3.198438 -0.529228 2.761338
H  -0.072833 2.472507 0.75632
H  -1.100863 3.418835 -0.318152
H  4.812068 0.457948 1.104943
H  -0.659898 -4.522307 -0.725849
H  -2.037687 -3.47269 -1.425794
H  -4.904232 0.334112 1.190529
H  -3.54832 0.999787 2.289541
