program: Gaussian 09
title: 000198917
version: EM64L-G09RevD.01
frameworkgroup: C1[X(C14H12N2O2S)]
method: RPBEPBE
basis: SDD
operation: Freq
keyword: #p
keyword: freq=noraman
keyword: PBEPBE/SDD
title: #p freq=noraman PBEPBE/SDD
converged: YES YES NO NO
title: Mulliken charges:
elementType: S O O N N C C C C C C C C C C C C C C H H H H H H H H H H H H
charge: 0.891824 -0.551332 -0.562815 -0.198295 -0.122258 0.409084 -0.281899 0.081731 -0.371402 0.169497 -0.360878 -0.260767 -0.747650 -0.177375 -0.230217 -0.236673 -0.326512 -0.229822 -0.178776 0.360842 0.289244 0.311172 0.273526 0.290160 0.284141 0.259294 0.237059 0.243990 0.259880 0.232919 0.242309
chargesum: 0.00000
title: Mulliken charges with hydrogens summed into heavy atoms:
elementType: S O O N N C C C C C C C C C C C C C C
charge: 0.891824 -0.551332 -0.562815 -0.198295 -0.122258 0.409084 -0.281899 0.081731 -0.010560 0.169497 -0.071634 0.050405 0.100177 0.081919 0.006842 0.007316 -0.066632 0.003096 0.063533
polarizability: 3.16706881e+02 -2.60796790e+01 2.05199599e+02 4.65480899e+00 1.02092686e+01 1.04993740e+02
1716.lowfreq: -3.6694 -0.0005 0.0010 0.0019 5.3970 6.9609 43.2864 53.3145 81.2580
frequency: 43.2809 53.3079 81.2541 88.4339 116.2062 142.7523 152.7506 181.9426 201.8505 225.4166 241.4224 245.1857 263.9930 307.9343 318.7728 343.5729 396.2594 406.6106 429.9342 469.0985 508.2710 548.2726 569.5823 573.4935 588.2183 614.2987 631.3238 683.6444 685.5831 738.2722 742.8351 750.8799 779.8870 780.9499 788.5259 826.1917 845.1722 875.3781 897.4384 904.7013 917.3805 933.5382 967.5459 973.1879 983.6738 990.7060 1004.9760 1005.8479 1006.7528 1035.4133 1075.5752 1118.3990 1123.0246 1146.3616 1174.3607 1221.3701 1232.9204 1247.8238 1257.9948 1293.9257 1303.5846 1336.0574 1365.9600 1372.2965 1409.7155 1418.9176 1420.3338 1442.3756 1451.3259 1498.6369 1525.9527 1540.2675 1557.0917 1607.5628 1635.8086 3028.1666 3133.5687 3143.1917 3156.5476 3162.6018 3172.2740 3174.0306 3177.7106 3180.5478 3182.1238 3187.0412 3196.1568
redmass: 4.8887 5.0243 5.5143 4.8685 4.3674 2.2390 1.4820 6.1894 5.3287 5.5830 5.5212 4.9777 5.6587 5.8786 6.6410 6.0480 5.5997 8.1208 3.0546 3.8816 4.6159 4.5693 3.6852 6.6062 7.9951 6.3498 6.7690 4.7893 6.7012 2.9282 2.5933 1.8948 3.9196 1.5750 5.6059 1.3215 1.4616 3.8146 3.4654 1.7417 5.8906 1.3436 1.7961 1.2946 1.3647 2.6194 2.0395 1.5909 1.6279 2.8576 2.4579 1.6784 1.5951 1.2891 1.0660 1.4597 2.9935 1.9947 1.7968 2.6098 1.2611 2.0666 5.3370 2.2824 1.0589 1.0530 2.3886 2.5544 3.0406 5.2472 6.0015 5.3389 5.9792 7.0168 6.7650 1.0246 1.0879 1.0895 1.0878 1.0942 1.0894 1.0992 1.1073 1.1036 1.1074 1.0966 1.1014
irintensity: 2.8482 3.2706 4.3325 0.6361 8.1202 1.5062 0.9849 2.8229 0.5607 2.4488 0.9910 2.3661 2.5645 2.7569 18.8166 7.3105 7.1042 43.7789 8.9734 18.4112 5.3562 4.1199 2.2345 6.6921 34.3281 0.5471 2.1119 1.5561 5.9798 9.7461 10.9218 56.7452 1.3822 136.4080 20.5897 74.1321 17.2012 48.7286 2.3014 0.6390 0.5677 2.3493 35.7143 0.3310 7.6881 13.4800 22.3401 35.7283 10.1412 0.5346 29.4455 8.4269 0.8461 10.4020 1.5476 57.3933 30.0940 3.8439 6.0523 19.4721 8.3166 20.8098 7.7370 36.2916 7.5268 6.7388 6.7935 44.8351 19.2890 4.3469 6.8705 1.3707 0.6643 10.0380 8.6285 0.8033 12.9776 1.5616 4.4596 9.4226 4.0071 19.8940 0.3820 76.6244 2.3895 1.8981 9.6503
temp: 298.150 k
press: 1.00000 atm
elementType: 16 8 8 7 7 6 6 6 6 6 6 6 6 6 6 6 6 6 6 1 1 1 1 1 1 1 1 1 1 1 1
symmnumber: 1
zpe: 601324.0 jmol-1
zpe.correction: 0.229032 hartree
zpe.thermalcorrener: 0.245497 hartree
zpe.thermalcorrenthalpy: 0.246441 hartree
zpe.thermalcorrgfe: 0.184945 hartree
zpe.sumelectzpe: -1197.202208 hartree
zpe.sumelectthermal: -1197.185743 hartree
zpe.sumelectthermalent: -1197.184799 hartree
zpe.sumelectthermalfe: -1197.246296 hartree
dipole: 4.3693 1.7390 2.2982
dipole: 5.2342
quadrupole: -105.9378 -116.3740 -120.9030
quadrupole: -19.9232 -4.7154 -6.5775
quadrupole: 8.4671 -1.9690 -6.4981 -19.9232 -4.7154 -6.5775
hfenergy: -1197.4312404 hartree
pointgroup: C01 [X(C14H12N2O2S1)]
dipole: -1.5548374 -1.2320402 0.5524436 debye
polarizability: 321.6502355|-3.1896756|194.7442658|-12.2963156|23.7427637|110.5057182 unknown
InChI: InChI=1S/C14H12N2O2S/c1-19(17,18)13-7-3-2-6-11(13)12-10-16-9-5-4-8-14(16)15-12/h2-10H,1H3
charge 0 multiplicity 1
31 atoms
S  2.083255 2.046836 0.876902
O  3.583872 2.627509 1.17931
O  1.03626 2.999911 0.047335
N  -2.253436 0.375617 -0.011211
N  -0.985766 -1.537921 0.018439
C  1.29801 -0.598326 -0.257742
C  2.338285 0.318892 0.048926
C  -0.159082 -0.407296 -0.101151
C  -0.923984 0.778567 -0.12539
C  -2.253986 -1.062319 0.078344
C  1.727341 -1.858217 -0.776916
C  3.70135 0.059835 -0.17733
C  1.298755 1.655324 2.575326
C  -3.431023 1.115321 0.014215
C  3.084902 -2.146945 -1.007825
C  4.081421 -1.18501 -0.721793
C  -3.503424 -1.73192 0.208595
C  -4.641052 0.449146 0.137723
C  -4.682022 -0.985377 0.237895
H  -0.613331 1.815571 -0.250155
H  0.945984 -2.593725 -0.989392
H  4.438365 0.825457 0.091675
H  2.026111 1.034344 3.115366
H  1.159759 2.638272 3.046888
H  0.347782 1.138611 2.387924
H  -3.337534 2.200409 -0.067255
H  3.366858 -3.123396 -1.41597
H  5.138674 -1.399314 -0.907281
H  -3.498536 -2.82216 0.279671
H  -5.564578 1.033277 0.157119
H  -5.648125 -1.489376 0.336159
