program: Gaussian 09
title: 000017166
version: EM64L-G09RevD.01
frameworkgroup: C1[X(C9H16O)]
method: RPBEPBE
basis: SDD
operation: Freq
keyword: #pfreq=noraman
keyword: PBEPBE/SDD
title: #p freq=noraman PBEPBE/SDD
converged: NO YES NO NO
title: Mulliken charges:
elementType: O C C C C C C C C C H H H H H H H H H H H H H H H H
charge: -0.211479 -0.358831 -0.353598 -0.377447 -0.354357 -0.460687 -0.693700 -0.109967 -0.260065 -0.104960 0.188772 0.194909 0.191658 0.188648 0.216294 0.198589 0.195229 0.196225 0.220858 0.212104 0.210763 0.217317 0.209993 0.223679 0.263798 0.156256
chargesum: 0.00000
title: Mulliken charges with hydrogens summed into heavy atoms:
elementType: O C C C C C C C C C
charge: -0.211479 0.024850 0.026707 0.037436 0.037098 -0.027726 -0.055627 0.113712 0.003733 0.051295
polarizability: 1.59918319e+02 -9.79168074e+00 7.77909638e+01 -9.97201622e+00 -2.14949750e+00 8.43277785e+01
1716.lowfreq: -17.7092 -3.5604 -0.0010 -0.0008 -0.0008 14.1120 28.4296 43.1336 64.0591
frequency: 28.1317 42.9254 63.8568 85.3580 115.0849 130.4748 146.1854 174.5733 227.8233 237.6568 237.7716 310.9918 408.2732 434.6633 493.5400 557.6518 722.7044 736.5014 780.2888 824.1734 880.1783 888.9613 967.8123 973.2807 999.8567 1001.6480 1009.0520 1045.3236 1063.9779 1077.6194 1110.1126 1114.8186 1162.3225 1190.0765 1217.8983 1232.5730 1258.5625 1269.5055 1284.6340 1286.7747 1293.2320 1296.1923 1322.7090 1344.0354 1352.7194 1383.1011 1389.4655 1453.6420 1462.3035 1464.8797 1472.8892 1478.2313 1481.2985 1487.8499 1601.5964 1649.4517 2846.7025 2949.8585 2952.6553 2954.0379 2964.3354 2969.3790 2970.5842 2986.9707 3001.5623 3017.9285 3030.0214 3044.7163 3059.5919 3067.1289 3069.8652 3125.2677
redmass: 4.4262 2.2758 2.3077 2.7074 1.8723 2.4840 2.5529 4.1133 2.7566 1.9379 1.5877 2.8371 2.8982 3.3144 2.7800 4.0876 1.0640 1.1051 1.1980 1.4257 1.3339 1.8583 1.3439 1.6297 1.4532 2.4280 2.8570 1.6960 2.4203 2.2410 2.4593 2.7751 2.1349 1.6254 1.2986 1.3632 1.3443 1.2129 1.1070 1.2386 1.1995 1.1689 1.3703 1.4832 1.6488 1.2539 1.2155 1.0923 1.0665 1.0774 1.0767 1.0429 1.0804 1.0871 7.6955 5.5635 1.0846 1.0590 1.0626 1.0589 1.0596 1.0602 1.0365 1.0970 1.0998 1.0992 1.1013 1.1004 1.0932 1.1007 1.0993 1.0927
irintensity: 2.3174 1.2400 0.1080 1.7949 0.6373 0.2885 1.3905 4.9556 4.2750 0.1564 0.6021 4.9091 1.3786 3.6251 3.7658 6.3260 12.9872 1.2138 5.7999 0.4707 7.5806 3.4430 15.0136 10.0779 27.7962 13.2448 5.0523 19.1385 10.3477 0.1800 1.4514 40.3701 44.0329 2.0245 4.2315 2.4337 0.7850 1.2557 0.3341 0.6071 1.8480 1.0052 0.9029 2.1189 0.5175 11.3948 10.7409 4.5739 0.3918 1.1979 2.1165 12.6113 4.6688 23.4199 150.9523 211.9192 113.7832 0.1883 11.3517 7.9387 26.6291 103.5996 49.9373 2.2106 1.4164 3.4399 24.4720 59.1535 54.1961 98.6689 52.7408 9.6123
temp: 298.150 k
press: 1.00000 atm
elementType: 8 6 6 6 6 6 6 6 6 6 1 1 1 1 1 1 1 1 1 1 1 1 1 1 1 1
symmnumber: 1
zpe: 596564.6 jmol-1
zpe.correction: 0.227219 hartree
zpe.thermalcorrener: 0.239941 hartree
zpe.thermalcorrenthalpy: 0.240885 hartree
zpe.thermalcorrgfe: 0.186478 hartree
zpe.sumelectzpe: -426.942793 hartree
zpe.sumelectthermal: -426.930071 hartree
zpe.sumelectthermalent: -426.929127 hartree
zpe.sumelectthermalfe: -426.983535 hartree
dipole: -4.7511 0.9437 1.4610
dipole: 5.0594
quadrupole: -96.8562 -63.7335 -60.5435
quadrupole: 3.5317 7.1794 -1.3442
quadrupole: -23.1451 9.9775 13.1676 3.5317 7.1794 -1.3442
hfenergy: -427.1700125 hartree
pointgroup: C01 [X(C9H16O1)]
dipole: 1.8739127 0.4788981 -0.4704421 debye
dipolederiv: -1.1363291 -0.197342 0.1146381 -0.2242989 -0.413102 0.0226764 0.2546772 0.0581108 -0.4862312 -0.0406721 0.0332607 -0.0079992 0.1210259 0.1231866 -0.0471215 0.0508183 -0.0362717 0.1569919 -0.0914947 0.0131307 -0.0174229 -0.0713264 0.0952609 -0.0403255 -0.0693136 -0.0443762 0.1576525 0.0660101 0.0003791 -0.0221041 -0.1678015 0.0800295 -0.0252841 -0.1693888 -0.0624733 0.1662645 0.0400874 0.0204444 -0.0044175 0.0969784 0.1129661 -0.0323907 0.0392825 -0.0335947 0.156086 -0.4179869 -0.0437834 -0.0163547 -0.014272 0.0892996 -0.043017 0.0661798 -0.0078378 0.113855 -0.0800603 0.0558269 0.013206 0.0147614 0.0510892 -0.0193044 -0.0141319 -0.0174231 0.0863051 0.6682896 0.2322207 -0.0222721 0.379727 -0.1023317 0.0276895 -0.0784349 -0.0029316 0.1603682 -0.9943617 -0.1944826 -0.0015672 -0.3217292 -0.2179777 0.0259535 -0.1082293 0.0009853 0.0273259 1.5057298 0.3748133 -0.1535157 0.4653396 0.2703151 0.0196187 0.1862671 0.1051732 0.6947949 0.0277214 -0.0276712 0.0063841 -0.0277378 -0.1619111 0.0721744 0.0085088 0.0981798 0.0297965 0.0415344 0.0045195 0.0105632 -0.0012674 0.0528953 -0.033927 -0.001009 -0.0597814 -0.1800165 0.0359948 -0.0392368 0.0114948 -0.0264753 -0.1579048 0.0700627 0.0158748 0.094767 0.0320822 0.0389555 0.0039202 -0.0017638 0.0071402 0.0537467 -0.0333525 0.0057352 -0.0590864 -0.1904687 0.035855 -0.0193088 0.0097105 -0.0071274 -0.1312272 0.0623275 0.0144445 0.0857795 0.036379 0.0510556 0.0127961 -0.0004869 -0.0000093 0.0547514 -0.0297992 -0.002891 -0.0547561 -0.1764572 0.0287918 0.0003431 -0.0004273 -0.0348885 -0.1759607 0.0747876 0.0114371 0.1037077 0.0379648 0.0289042 0.0161245 0.0387255 0.0019855 0.0587395 -0.0416649 -0.0004708 -0.0651637 -0.1942205 0.0261808 0.0044657 0.0197891 0.0124577 0.0711617 -0.0133118 -0.0138234 -0.0580442 -0.1419494 0.0362475 -0.0787699 0.0236363 -0.0546019 -0.0998489 0.0671108 -0.0541171 0.0774239 0.0562926 0.0808135 -0.0479291 0.0336132 0.0204419 -0.1464429 0.086287 0.0184709 0.1023459 0.042887 -0.2035357 -0.0526783 -0.0645808 -0.0796126 0.0519766 -0.0380095 -0.0838485 -0.0341471 0.070664 0.0856773 0.0132149 -0.0112754 0.0301287 0.0719989 -0.023154 0.0539778 -0.0489967 -0.1823366 0.0648835 -0.0285359 -0.0243122 -0.0496155 0.1251281 -0.0500366 -0.0401436 -0.0416901 -0.1156381 0.0674637 -0.0397295 -0.0227739 -0.0394997 0.1509337 -0.0379667 -0.0419297 -0.0420601 -0.0713254 0.0342443 -0.0159927 0.0895128 -0.029723 0.0932283 -0.020023 -0.0479425 -0.0578389 -0.2870663 unknown
polarizability: 160.1135218|11.2613049|77.0389528|-7.2551657|0.5966284|84.8845867 unknown
InChI: InChI=1S/C9H16O/c1-2-3-4-5-6-7-8-9-10/h7-9H,2-6H2,1H3
charge 0 multiplicity 1
26 atoms
O  -5.415356 -0.655187 0.320307
C  1.849991 0.542271 0.189399
C  3.041538 -0.373875 -0.169737
C  0.490948 -0.014889 -0.290249
C  4.40133 0.180911 0.313946
C  -0.696551 0.918384 0.081951
C  5.588492 -0.736296 -0.051528
C  -2.015922 0.413959 -0.438293
C  -3.120663 0.128445 0.315228
C  -4.356903 -0.37219 -0.308402
H  2.012187 1.547193 -0.254878
H  1.819207 0.689831 1.289301
H  2.879474 -1.379748 0.271411
H  3.076786 -0.519269 -1.270047
H  0.319738 -1.01639 0.152257
H  0.516681 -0.156112 -1.390711
H  4.561059 1.187606 -0.124352
H  4.366531 0.322833 1.413751
H  -0.741249 1.050375 1.179766
H  -0.493592 1.919464 -0.356755
H  5.46681 -1.740149 0.39807
H  6.548111 -0.319897 0.306779
H  5.665113 -0.867632 -1.147717
H  -2.077057 0.252808 -1.529396
H  -3.126438 0.261688 1.405241
H  -4.300867 -0.496032 -1.422944
