program: Gaussian 09
title: 000198965
version: EM64L-G09RevD.01
frameworkgroup: C1[X(C8H7Cl4NO2S2)]
method: RPBEPBE
basis: SDD
operation: Freq
keyword: #p
keyword: freq=noraman
keyword: PBEPBE/SDD
title: #p freq=noraman PBEPBE/SDD
converged: YES YES NO NO
title: Mulliken charges:
elementType: Cl Cl Cl Cl S S O O N C C C C C C C C H H H H H H H
charge: -0.027567 0.120017 0.126873 0.132390 0.973697 0.507151 -0.509234 -0.514887 -0.620041 0.357950 -0.741236 -0.238509 -0.303001 -0.177418 -0.183387 -0.112353 -0.669443 0.275162 0.294507 0.285932 0.243515 0.255210 0.261891 0.262783
chargesum: 0.00000
title: Mulliken charges with hydrogens summed into heavy atoms:
elementType: Cl Cl Cl Cl S S O O N C C C C C C C C
charge: -0.027567 0.120017 0.126873 0.132390 0.973697 0.507151 -0.509234 -0.514887 -0.620041 0.357950 0.114365 0.005006 -0.047791 0.084473 0.079396 -0.112353 -0.669443
polarizability: 2.93287532e+02 -2.61831896e+01 1.92109818e+02 1.11283443e+01 1.10669330e+01 1.55439672e+02
1716.lowfreq: -9.6051 -4.3110 -0.0023 0.0021 0.0023 2.4118 15.0990 23.4578 26.8458
frequency: 12.6751 23.3495 26.7704 43.4017 52.5821 69.6334 101.6349 111.2873 128.3139 137.1709 153.1845 166.5208 175.5208 209.1707 235.2485 247.9383 255.6802 278.0840 284.1647 310.0009 319.9880 354.7436 361.1176 377.9485 391.7036 406.8965 445.2188 501.1680 558.8922 572.1177 622.1416 649.0656 655.5827 689.7388 703.3711 722.4798 808.9042 815.8435 836.9894 845.0931 896.5539 954.3058 966.3049 973.6978 994.5064 1019.9135 1071.3047 1106.2253 1169.7594 1200.5217 1286.4738 1303.1032 1358.9810 1402.0246 1415.9737 1418.2825 1458.1083 1566.0673 1581.2950 3035.2398 3144.9826 3155.8882 3176.2245 3179.8457 3183.2756 3193.4036
redmass: 4.3828 15.4596 19.7159 6.5377 11.3534 9.6678 10.4211 8.6411 12.7365 5.4218 1.1769 8.4897 7.1613 18.7735 14.1157 5.6346 7.4047 10.7437 24.2126 19.7221 8.3435 9.0046 13.1282 8.0589 16.2678 2.9368 9.8339 4.0702 5.2937 8.5093 7.4132 10.5257 11.8232 10.8660 7.0977 4.2723 5.9758 1.4226 2.0773 3.6169 3.3167 1.3736 1.3668 1.2782 3.8321 1.7744 2.8472 1.3237 1.4019 2.6383 1.2565 1.1325 5.0133 4.2997 1.0552 1.0536 2.2371 7.5778 6.3559 1.0243 1.0902 1.0890 1.0959 1.0975 1.1074 1.1078
irintensity: 0.8107 0.2655 0.2248 2.9107 0.5173 2.3093 0.7452 1.5375 6.9950 1.0085 0.7033 0.2969 3.4064 5.6216 4.9045 1.7295 1.7995 3.9036 2.4575 4.2007 22.9603 38.0648 16.7684 5.3451 20.9845 0.5440 6.8634 17.3084 74.2036 29.4689 9.5550 55.6505 129.5110 133.3430 95.5701 21.2497 38.1191 7.7067 30.7396 24.7297 20.3890 1.3849 0.5752 49.7887 39.3173 24.8209 81.5625 11.9175 9.9377 4.1970 1.1669 6.7773 0.4691 11.3445 11.8457 6.8042 58.7579 1.1369 88.9857 0.8826 3.2870 1.9706 1.9828 1.2664 0.2750 0.6146
temp: 298.150 k
press: 1.00000 atm
elementType: 17 17 17 17 16 16 8 8 7 6 6 6 6 6 6 6 6 1 1 1 1 1 1 1
symmnumber: 1
zpe: 358123.7 jmol-1
zpe.correction: 0.136402 hartree
zpe.thermalcorrener: 0.156706 hartree
zpe.thermalcorrenthalpy: 0.157650 hartree
zpe.thermalcorrgfe: 0.083068 hartree
zpe.sumelectzpe: -3149.125730 hartree
zpe.sumelectthermal: -3149.105427 hartree
zpe.sumelectthermalent: -3149.104483 hartree
zpe.sumelectthermalfe: -3149.179065 hartree
dipole: 0.6782 -0.9268 3.2132
dipole: 3.4123
quadrupole: -151.6447 -147.1220 -131.5238
quadrupole: -3.2123 -1.8231 15.2604
quadrupole: -8.2145 -3.6918 11.9064 -3.2123 -1.8231 15.2604
hfenergy: -3149.2621324 hartree
pointgroup: C01 [X(C8H7Cl4N1O2S2)]
dipole: -0.545987 -0.34035 -1.1782757 debye
dipolederiv: -1.0873428 0.0113661 0.1242041 0.0682106 -0.0516583 -0.0037242 0.1142795 0.0001416 -0.1207578 -0.4706155 -0.0875057 0.2244643 -0.220094 -0.3246301 0.2249245 0.3940203 0.0773411 -0.3975473 -0.4310254 0.3795344 -0.1926327 0.3619906 -0.5042752 0.2140448 -0.1862164 0.189596 -0.2982099 -0.3201886 -0.288174 -0.2391107 -0.0862056 -0.4591258 -0.210302 -0.0723379 -0.4304203 -0.3836276 0.7294427 0.2661289 -0.0281536 0.2911825 1.4421007 -0.0189157 -0.2015099 -0.0125137 0.9703493 -0.1286369 0.0869188 0.0601696 0.0073266 -0.0733972 0.0204736 -0.0366458 -0.0328021 -0.1444126 -0.8156751 -0.2976763 -0.011736 -0.3103748 -0.5453603 0.0016656 -0.0569912 -0.0666113 -0.4251207 -0.3157052 0.1802705 0.024234 -0.0802035 -0.9001149 -0.0022921 0.0302007 -0.0242433 -0.4425031 0.4989096 0.0961709 -0.0413061 0.1868362 0.2120029 -0.1873825 0.1404027 -0.0034387 -0.1221328 -0.0770937 -0.1131173 0.0408756 0.1582933 -0.257011 0.019997 -0.0319276 -0.0261543 -0.0400203 -0.0710591 -0.0455959 0.0182001 -0.0750925 -0.2061355 0.0470164 0.0196927 -0.0230161 -0.1454963 0.1860611 0.0613898 0.0583878 -0.0462521 -0.0698697 -0.0027509 -0.1783066 -0.0620842 0.0317568 0.1598325 -0.0124127 -0.1119838 -0.0880205 -0.1146253 0.0268055 0.243216 0.0272568 0.0148754 -0.5784929 -0.0601807 -0.049624 0.0434311 -0.0653149 0.0090367 -0.2270689 -0.0464999 0.0572175 -0.4382442 -0.0000252 0.183375 0.0344124 -0.0444708 -0.0201385 0.2969482 0.0218441 -0.0626823 1.543794 -0.0615577 -0.1770631 -0.1276266 -0.0588949 -0.0000713 -0.1285025 0.0309489 0.1820891 1.3273752 -0.1242787 0.1264084 -0.1360642 1.2841373 -0.1306801 -0.179542 0.2917495 1.1479309 -0.0172376 -0.0142871 -0.0330994 -0.0191312 0.1078525 -0.0095746 -0.003133 0.0061994 0.0296433 0.0921168 -0.0488917 0.0097397 -0.039092 0.0181356 0.0086029 0.0507001 0.0793989 0.0396714 0.0680577 0.0331934 0.0249206 0.0334637 0.0664779 -0.0191996 0.0200345 -0.0155851 0.0434968 0.0061588 0.024647 -0.0843011 -0.0035593 0.1233215 0.0177274 -0.0690535 0.013148 0.0510159 0.0704367 0.0023567 0.0794167 0.0039691 0.1074023 0.0053761 0.0634002 -0.0036658 -0.0093759 0.050118 0.0035141 0.0536685 0.0203988 0.1545242 0.0010449 0.0559963 0.0035387 0.0004915 0.0190139 0.0082125 -0.0590538 0.0222013 0.1589289 0.0083159 -0.0576559 0.0058717 0.0233488 unknown
polarizability: 298.208798|-10.0109858|184.5611043|-13.4091108|-14.3605736|158.0671197 unknown
InChI: InChI=1S/C7H4Cl4NS.CH3O2S/c8-5-1-3-6(4-2-5)12-13-7(9,10)11;1-4(2)3/h1-4H;1H3
charge 0 multiplicity 1
24 atoms
Cl -5.460107 0.494009 0.7421
Cl 3.548364 -0.89054 -1.352887
Cl 3.501351 -3.096845 0.731691
Cl 1.290544 -2.891616 -1.352141
S  1.301039 2.078718 -0.078604
S  1.52667 -0.915633 1.037748
O  2.752838 2.048218 0.659153
O  0.11985 3.090912 0.418535
N  0.518417 0.046817 -0.097693
C  -0.882465 0.132365 0.192109
C  1.568956 2.350803 -1.946585
C  -1.44896 0.140738 1.497557
C  -1.733795 0.258019 -0.941078
C  -2.842195 0.242241 1.66766
C  -3.127821 0.36901 -0.779293
C  -3.662402 0.357743 0.525673
C  2.449952 -1.93047 -0.265704
H  0.57353 2.301598 -2.406967
H  2.026517 3.345573 -2.042052
H  2.231045 1.539401 -2.274709
H  -0.802364 0.070903 2.379328
H  -1.291592 0.233939 -1.941943
H  -3.283512 0.246885 2.668117
H  -3.786559 0.451512 -1.648115
