program: Gaussian 09
title: 000198903
version: EM64L-G09RevD.01
frameworkgroup: C1[X(C9H18N3O2)]
method: RPBEPBE
basis: SDD
operation: Freq
keyword: #p
keyword: freq=noraman
keyword: PBEPBE/SDD
title: #p freq=noraman PBEPBE/SDD
converged: YES YES NO NO
title: Mulliken charges:
elementType: O O N N N C C C C C C C C C H H H H H H H H H H H H H H H H H H
charge: -0.149646 -0.103530 -0.035050 -0.051893 -0.109543 -0.379028 -0.454344 -0.363057 -0.355896 0.282164 -0.638302 -0.647020 0.125922 -0.698627 0.250521 0.224891 0.293675 0.279022 0.258365 0.212556 0.240806 0.242532 0.204055 0.236628 0.251573 0.238185 0.188954 0.260342 0.355092 0.301529 0.245114 0.294010
chargesum: 1.00000
title: Mulliken charges with hydrogens summed into heavy atoms:
elementType: O O N N N C C C C C C C C C
charge: -0.149646 -0.103530 -0.035050 -0.051893 0.245549 0.096384 0.118352 0.107864 0.127441 0.282164 0.053954 0.040461 0.125922 0.142027
polarizability: 3.06457808e+02 9.82108768e+00 1.32522670e+02 -9.38837641e+00 1.74829206e+00 9.00794498e+01
1716.lowfreq: -38.6451 -2.6452 -0.0005 -0.0001 0.0002 3.6642 15.0947 28.0278 41.4315
frequency: -38.4323 28.0140 41.2705 49.6096 61.8799 75.6766 108.9401 115.8604 157.4978 215.6221 239.1281 251.6505 257.2254 267.1636 292.1657 318.5338 319.7109 416.8325 442.8288 459.1212 494.1345 513.3521 576.3442 595.9585 652.0574 661.4944 680.6127 736.4533 767.8090 779.0356 790.5842 836.0368 879.4846 896.2866 910.1553 976.8525 995.5269 1023.5002 1033.7981 1057.1718 1069.7828 1089.9660 1097.8921 1106.6343 1119.9210 1201.3033 1232.3371 1261.2485 1271.4102 1281.5910 1311.0724 1323.5587 1325.0657 1349.7961 1352.6238 1367.8547 1386.7298 1388.5782 1395.0787 1405.7895 1444.7259 1447.2685 1453.2485 1460.8973 1468.5662 1471.4874 1475.1924 1479.1846 1484.4907 1485.7344 1556.6180 1752.1119 2965.3079 2976.5815 2978.7397 2984.1709 2985.3520 2988.9636 3033.2706 3040.2333 3058.4725 3061.0423 3075.6095 3083.0236 3087.8150 3096.3875 3100.9781 3121.3384 3136.1273 3327.0603
redmass: 1.1396 3.3262 3.0351 2.9332 4.5022 2.5149 3.2767 2.1116 4.9755 1.3397 1.3962 2.1038 2.5171 3.0138 3.5508 2.3040 2.9260 2.7249 2.1890 3.0717 4.8814 5.2936 5.8155 2.8445 6.8290 6.8153 6.8438 2.4866 1.1501 1.2336 1.2727 5.5602 3.7026 2.6570 2.3205 3.1905 2.8924 1.4583 1.9907 2.0503 1.8852 1.7595 2.2528 1.6256 2.6647 2.0448 1.7477 1.3008 1.2427 1.3381 1.4292 1.2810 1.2231 1.6408 1.4035 1.3700 1.5346 1.2798 1.2443 1.2099 1.0910 1.1138 1.1019 1.0576 1.0715 1.0602 1.0569 1.0689 1.0743 1.0769 4.3275 12.5607 1.0573 1.0635 1.0640 1.0374 1.0437 1.0363 1.1055 1.1029 1.0960 1.0584 1.0898 1.0986 1.1003 1.1003 1.1009 1.1008 1.1088 1.0797
irintensity: 1.6469 1.2399 1.2294 2.1785 4.2195 1.7416 2.3196 1.8197 1.3324 1.8634 1.7011 0.0242 12.9329 2.0019 3.9128 0.3366 0.7994 6.7857 1.7733 8.7148 40.4520 35.9250 40.6932 51.5540 32.1107 12.3978 46.4350 7.5342 1.3629 6.6551 30.3435 47.6392 94.9484 1.3319 12.8706 105.1381 2.4247 21.9527 2.8957 4.6898 61.4564 40.8197 71.2111 18.4755 5.0297 19.5837 47.7076 36.0659 63.5801 35.6726 54.5453 12.1481 27.9913 16.2350 43.2391 4.0254 15.2847 15.2279 24.4880 36.2715 35.6098 17.3429 8.6006 0.1862 42.9213 8.9602 18.6088 0.5444 16.5677 15.9085 203.4223 734.0573 15.0100 18.0271 58.7167 9.4967 6.6059 18.0528 4.2018 13.1071 1.0104 0.9490 0.9192 36.3010 46.3476 33.3459 13.0961 2.3177 0.6612 32.2791
temp: 298.150 k
press: 1.00000 atm
elementType: 8 8 7 7 7 6 6 6 6 6 6 6 6 6 1 1 1 1 1 1 1 1 1 1 1 1 1 1 1 1 1 1
symmnumber: 1
zpe: 708151.1 jmol-1
zpe.correction: 0.269720 hartree
zpe.thermalcorrener: 0.285542 hartree
zpe.thermalcorrenthalpy: 0.286486 hartree
zpe.thermalcorrgfe: 0.225141 hartree
zpe.sumelectzpe: -666.986756 hartree
zpe.sumelectthermal: -666.970935 hartree
zpe.sumelectthermalent: -666.969991 hartree
zpe.sumelectthermalfe: -667.031335 hartree
dipole: -4.5512 1.1081 0.0235
dipole: 4.6842
quadrupole: -71.9700 -66.3424 -81.7325
quadrupole: 5.3476 -2.7948 -3.0197
quadrupole: 1.3783 7.0059 -8.3842 5.3476 -2.7948 -3.0197
hfenergy: -667.2564764 hartree
pointgroup: C01 [X(C9H18N3O2)]
dipole: 1.7994379 -0.3979404 -0.0024774 debye
polarizability: 305.8969493|13.0688307|133.0700417|10.701681|0.3870274|90.0929367 unknown
InChI: InChI=1S/C9H18N3O2/c1-4-11(5-2)6-7-12-8(3)9(13)14-10-12/h10H,4-7H2,1-3H3
charge 1 multiplicity 1
32 atoms
O  -3.010291 1.422647 0.233757
O  -4.425899 -0.468812 0.579946
N  2.532182 -0.049568 0.904349
N  -1.088861 0.232102 -0.244019
N  -1.651404 1.553377 -0.252947
C  1.116712 0.067073 1.028035
C  0.354576 0.101093 -0.405471
C  3.159122 -1.370707 0.672853
C  3.387433 1.159565 0.938574
C  -2.027262 -0.70351 0.000434
C  3.744587 -1.572756 -0.745779
C  3.29575 2.080091 -0.303201
C  -3.305859 -0.046313 0.309204
C  -1.864134 -2.180942 -0.112281
H  0.685981 -0.787359 1.586602
H  0.858471 1.000144 1.566623
H  0.719399 0.952897 -1.000118
H  0.56603 -0.831886 -0.949421
H  3.968283 -1.505881 1.418028
H  2.402509 -2.149801 0.885694
H  3.138262 1.74424 1.847443
H  4.429185 0.814556 1.058979
H  2.972111 -1.484232 -1.531316
H  4.539481 -0.837791 -0.961004
H  4.194045 -2.578689 -0.821313
H  3.524865 1.531799 -1.233211
H  2.298532 2.54911 -0.402227
H  4.02592 2.902654 -0.20447
H  -1.144435 2.215094 0.370756
H  -2.530125 -2.677564 0.61327
H  -0.831836 -2.523565 0.06036
H  -2.181134 -2.525869 -1.116727
