program: Gaussian 09
title: 000198945
version: EM64L-G09RevD.01
frameworkgroup: C1[X(C21H27ClN2OS)]
method: RPBEPBE
basis: SDD
operation: Freq
keyword: #p
keyword: freq=noraman
keyword: PBEPBE/SDD
title: #p freq=noraman PBEPBE/SDD
converged: YES YES NO NO
title: Mulliken charges:
elementType: Cl S O N N C C C C C C C C C C C C C C C C C C C C C H H H H H H H H H H H H H H H H H H H H H H H H H H H
charge: -0.054367 0.201580 -0.244484 -0.113355 -0.149158 -0.329279 -0.415748 -0.349784 -0.348051 -0.431976 -0.325411 -0.315285 -0.369416 0.426227 -0.710747 -0.376421 -0.366313 -0.243820 -0.245114 -0.280945 -0.174919 -0.192125 -0.247180 -0.214168 -0.196804 -0.099217 0.193162 0.199195 0.205953 0.239007 0.203189 0.219992 0.194892 0.210900 0.246185 0.213573 0.193232 0.218217 0.215139 0.192753 0.243427 0.235784 0.284293 0.266600 0.261900 0.237849 0.214523 0.218872 0.225379 0.253834 0.259251 0.260254 0.258921
chargesum: 0.00000
title: Mulliken charges with hydrogens summed into heavy atoms:
elementType: Cl S O N N C C C C C C C C C C C C C C C C C C C C C
charge: -0.054367 0.201580 -0.244484 -0.113355 -0.149158 0.063078 0.029212 0.073397 0.057742 0.027782 0.086038 0.092608 0.109795 0.426227 -0.159854 -0.114520 -0.128463 -0.029297 -0.026242 -0.055566 -0.174919 0.061710 0.012071 0.046087 0.062116 -0.099217
polarizability: 3.42968980e+02 -2.53637142e+01 2.94148953e+02 -3.22248916e+01 -8.51457478e+00 1.85303201e+02
1716.lowfreq: -23.9346 -8.8047 -6.7695 -0.0008 -0.0007 0.0005 2.1093 10.7514 13.0418
frequency: -20.5383 10.0947 11.6681 16.2688 24.9646 30.4853 45.0104 61.1617 64.2842 82.6492 94.0216 140.5204 166.2507 191.6276 205.6123 215.0590 231.1063 241.4888 248.4165 280.3550 289.3240 297.4575 317.0764 329.6310 352.6326 363.1603 389.0034 394.8931 407.4151 409.4626 425.1450 462.3991 470.8909 484.4807 501.7405 512.2139 541.2835 579.4105 586.1328 614.1245 619.7616 686.2380 694.9662 700.7187 713.2863 719.9072 741.7744 752.1157 761.2965 790.2292 809.2229 818.0400 825.4380 827.6216 839.5485 857.5330 878.8919 899.5579 945.8277 954.6010 958.2049 961.1175 963.9221 975.8090 976.8442 990.5744 1005.0213 1021.5090 1026.0330 1028.4754 1038.6649 1049.2988 1053.5507 1066.6371 1070.9256 1072.5205 1091.7750 1093.3329 1103.4488 1104.6476 1126.7655 1134.1742 1166.1534 1173.1587 1181.5061 1187.2952 1200.5251 1206.6686 1221.8042 1233.8736 1239.8969 1262.7536 1275.1707 1280.0472 1285.9289 1291.8977 1299.0388 1312.7268 1327.2753 1339.6832 1342.7046 1350.8678 1353.5656 1355.6026 1361.1452 1371.7332 1379.4252 1381.6394 1383.1620 1388.8212 1442.4435 1444.4795 1445.8310 1448.7580 1450.6870 1455.5207 1456.1898 1467.4000 1474.7443 1484.0096 1499.4337 1507.9950 1575.2168 1575.2991 1575.6702 1617.9802 2864.7254 2868.8778 2883.0356 2947.4637 2953.5893 2989.6878 2994.2418 3002.1053 3003.5686 3026.2644 3035.3608 3038.7699 3040.5287 3056.9980 3062.8379 3081.7777 3084.8605 3108.7746 3114.7930 3123.1992 3142.2251 3144.6658 3151.0943 3153.5068 3165.4809 3170.4357 3174.9017
redmass: 3.5919 5.9838 7.3927 4.5399 5.8639 4.4685 5.8058 4.5840 4.7583 3.7800 6.3506 3.8191 3.6645 3.7481 4.3298 3.7363 3.1591 4.3463 2.1190 2.9159 2.5878 10.9471 6.0490 2.1356 4.7830 4.3625 2.2545 2.7174 2.9231 3.4007 3.0325 3.2548 2.8695 3.7315 5.6667 2.8545 3.6331 2.0492 3.7296 6.3538 7.0912 4.5190 3.6051 2.0123 7.0899 2.0229 3.1388 1.8561 1.3094 1.9500 2.7963 1.3498 1.3264 1.2640 1.6237 1.9687 1.4359 2.3472 1.3213 2.2219 2.1220 1.4201 1.6899 2.8224 1.6037 5.4107 2.0849 3.4374 2.1817 2.2650 2.0747 2.4142 2.0194 7.5753 2.5612 1.9331 2.8505 1.8133 1.6340 1.8658 2.3117 1.8905 1.9910 1.0925 1.1268 1.0698 1.6205 1.1280 1.3741 1.4360 1.1942 1.3407 1.4557 1.2699 1.2403 1.2350 1.2015 1.3019 1.2821 1.3453 1.2406 1.3563 4.2185 1.4054 1.3927 1.2707 5.4155 4.0521 1.4426 1.8118 1.0861 1.1667 1.0799 1.1068 2.0467 1.1099 2.1417 1.0967 1.0893 1.1073 2.2543 1.1298 6.2357 5.9428 7.5229 5.8993 1.0705 1.0696 1.0689 1.0673 1.0670 1.0602 1.0646 1.0614 1.0885 1.0900 1.0587 1.0935 1.0935 1.1024 1.1032 1.0953 1.0972 1.1067 1.0854 1.0879 1.0937 1.0890 1.0890 1.0927 1.0999 1.0962 1.0974
irintensity: 0.1125 0.0969 0.0363 0.3066 0.3059 0.3350 0.1240 0.7991 0.2772 0.1235 0.0521 2.3974 0.8498 0.8552 4.2222 0.7453 0.8723 0.4116 2.2742 13.4189 2.2623 1.2538 0.0599 6.2511 2.8542 5.2310 2.4953 0.0921 0.3767 9.2326 0.5153 7.7401 1.9530 24.9244 28.1140 8.3181 2.1523 7.8656 5.2223 1.4472 0.0563 33.4248 2.4645 24.3349 5.8559 16.8692 5.7442 74.2760 7.6753 7.8128 15.3014 38.7405 31.4934 7.0348 0.3815 5.9379 6.8337 9.2313 0.1348 23.3594 21.3627 0.4470 1.6996 6.3478 5.2011 66.9944 0.6683 7.6655 11.9660 5.9827 17.1163 23.9063 4.4066 2.2348 22.4489 56.7172 28.2909 5.0118 7.8587 0.6325 14.6434 73.6881 4.5675 1.0800 1.3612 4.6483 48.4593 13.8143 15.0130 49.0357 3.4605 7.2780 24.6327 15.4418 1.8692 4.3692 15.6820 1.9250 12.0200 10.8601 6.7807 22.4232 4.7913 6.5047 20.9553 1.6126 8.2543 5.6132 6.0111 29.8082 2.2633 11.7892 2.6467 15.0860 7.4347 0.2325 90.9363 6.6605 16.2165 18.2326 126.9644 18.3042 4.8527 9.9866 0.4344 135.9934 45.2173 33.4962 225.6908 42.4738 103.0837 21.6313 24.5360 22.5551 29.2920 45.9905 16.6373 12.6964 39.9742 7.7531 53.4973 38.4305 44.8172 11.8052 12.0915 13.1976 6.3821 7.8415 1.8057 33.5042 14.1050 4.9033 1.3692
temp: 298.150 k
press: 1.00000 atm
elementType: 17 16 8 7 7 6 6 6 6 6 6 6 6 6 6 6 6 6 6 6 6 6 6 6 6 6 1 1 1 1 1 1 1 1 1 1 1 1 1 1 1 1 1 1 1 1 1 1 1 1 1 1 1
symmnumber: 1
zpe: 1150199.0 jmol-1
zpe.correction: 0.438088 hartree
zpe.thermalcorrener: 0.462842 hartree
zpe.thermalcorrenthalpy: 0.463786 hartree
zpe.thermalcorrgfe: 0.378166 hartree
zpe.sumelectzpe: -1857.286877 hartree
zpe.sumelectthermal: -1857.262123 hartree
zpe.sumelectthermalent: -1857.261178 hartree
zpe.sumelectthermalfe: -1857.346799 hartree
dipole: 1.6354 -2.9910 0.8113
dipole: 3.5041
quadrupole: -193.0465 -168.0994 -168.5608
quadrupole: -10.6400 0.2398 -5.0678
quadrupole: -16.4776 8.4695 8.0081 -10.6400 0.2398 -5.0678
hfenergy: -1857.7249649 hartree
pointgroup: C01 [X(C21H27Cl1N2O1S1)]
dipole: -0.6361316 -1.2074406 -0.1950433 debye
polarizability: 342.270345|22.2934414|295.0574529|-35.4826817|-2.971037|185.0933359 unknown
InChI: InChI=1S/C21H27ClN2OS/c22-19-7-9-21(10-8-19)26-18-15-24(20-5-2-1-3-6-20)12-4-11-23-13-16-25-17-14-23/h1-3,5-10H,4,11-18H2
charge 0 multiplicity 1
53 atoms
Cl 7.349109 1.691974 -1.185424
S  3.230793 -2.672622 1.247878
O  -6.845971 0.88193 0.132521
N  -4.563778 -0.8440 -0.397345
N  -0.304086 -0.693637 0.126234
C  -3.773515 -1.918542 -1.055906
C  -2.28954 -1.522811 -1.217507
C  -4.943304 0.247985 -1.334547
C  -5.773679 -1.351994 0.302037
C  -1.57208 -1.445736 0.156926
C  -5.650995 1.378057 -0.568979
C  -6.462807 -0.200904 1.053608
C  0.942242 -1.464021 0.006851
C  -0.298308 0.714343 0.190439
C  1.599382 -1.708282 1.385425
C  -1.521475 1.451992 0.299297
C  0.923089 1.459954 0.149371
C  -1.509741 2.859789 0.368299
C  0.912865 2.868019 0.212242
C  -0.298583 3.588068 0.324672
C  4.347885 -1.38471 0.547093
C  4.480312 -0.106642 1.142958
C  5.144206 -1.721532 -0.574501
C  5.386268 0.838949 0.612186
C  6.069997 -0.791403 -1.100248
C  6.170458 0.479245 -0.501784
H  -3.839778 -2.824232 -0.420086
H  -4.206448 -2.193798 -2.049194
H  -1.78001 -2.255452 -1.873751
H  -2.209585 -0.541637 -1.720463
H  -5.623533 -0.133104 -2.137527
H  -4.03628 0.652698 -1.819433
H  -6.504144 -1.807938 -0.412548
H  -5.470297 -2.132259 1.025734
H  -2.267706 -0.99355 0.887474
H  -1.355839 -2.469936 0.516744
H  -4.947137 1.829554 0.164293
H  -6.015976 2.157127 -1.258259
H  -7.402574 -0.536112 1.522596
H  -5.775627 0.196131 1.832161
H  1.659197 -0.954356 -0.662848
H  0.717562 -2.438862 -0.461901
H  1.788233 -0.760386 1.914134
H  0.962663 -2.340878 2.027795
H  -2.482689 0.929272 0.332386
H  1.887645 0.950633 0.064244
H  -2.464734 3.392864 0.455707
H  1.867921 3.405707 0.173068
H  -0.298517 4.681574 0.375873
H  3.896824 0.155972 2.031534
H  5.038713 -2.705673 -1.04182
H  5.488871 1.827342 1.069379
H  6.6883 -1.049868 -1.964586
