program: Gaussian 09
title: 000198970
version: EM64L-G09RevD.01
frameworkgroup: C1[X(C14H17Cl2NO5S)]
method: RPBEPBE
basis: SDD
operation: Freq
keyword: #p
keyword: freq=noraman
keyword: PBEPBE/SDD
title: #p freq=noraman PBEPBE/SDD
converged: YES YES NO NO
title: Mulliken charges:
elementType: Cl Cl S O O O O O N C C C C C C C C C C C C C C H H H H H H H H H H H H H H H H H
charge: 0.034345 0.075881 0.921459 -0.239004 -0.214955 -0.547191 -0.548252 -0.270606 -0.154920 -0.548500 0.457580 -0.349970 -0.099612 -0.371262 -0.367808 -0.309947 -0.250378 -0.266732 0.363744 -0.730448 -0.739302 0.323565 -0.745791 0.284609 0.270237 0.233420 0.279464 0.252307 0.264382 0.231390 0.241759 0.292489 0.292093 0.344883 0.267513 0.266656 0.296536 0.244436 0.251515 0.264413
chargesum: 0.00000
title: Mulliken charges with hydrogens summed into heavy atoms:
elementType: Cl Cl S O O O O O N C C C C C C C C C C C C C C
charge: 0.034345 0.075881 0.921459 -0.239004 -0.214955 -0.547191 -0.548252 -0.270606 -0.154920 0.006346 0.457580 0.162914 -0.099612 -0.118955 -0.103426 0.163202 0.042111 0.025360 0.363744 -0.385564 0.091404 0.323565 0.014573
polarizability: 2.74948744e+02 -1.95758623e+00 1.90537143e+02 2.72491239e+00 2.06017343e+01 1.87698379e+02
1716.lowfreq: -5.9787 -3.8739 -0.0030 -0.0029 -0.0021 1.3982 8.6481 18.5024 21.7008
frequency: -5.3236 17.0270 21.6425 35.4929 47.5039 49.8577 56.6774 61.2956 69.1722 77.7085 80.8248 105.4263 126.4458 138.5801 154.4110 158.6928 190.4844 212.0309 217.5398 222.1168 238.4858 277.1290 283.6754 306.0811 327.1332 344.8658 351.4211 358.2282 374.8025 389.7370 407.7882 418.7843 431.4182 489.7724 537.0257 565.1903 568.3511 584.9460 602.6386 615.5993 626.0097 654.6608 706.3291 731.8063 747.4031 761.7277 776.5695 788.7168 802.1888 826.0168 860.4056 871.3135 886.8306 892.0509 957.0643 967.9220 985.2106 989.9256 995.0903 997.6656 1007.0162 1017.0722 1022.6214 1046.8826 1054.3325 1094.9092 1115.4141 1161.9168 1175.1069 1183.0818 1197.0473 1199.4407 1208.0588 1255.4125 1260.5053 1281.0235 1287.7260 1302.0916 1325.6113 1360.8799 1363.3923 1388.4915 1388.9409 1399.9237 1407.1943 1410.2769 1420.9983 1446.7648 1451.6751 1454.2056 1456.6512 1471.0925 1489.7161 1594.5392 1597.2615 1608.8230 1645.4058 2987.7839 3007.3428 3014.1700 3026.1062 3029.2470 3053.9847 3087.9349 3101.4157 3103.8327 3125.9900 3130.0161 3139.0348 3144.4327 3154.9891 3158.3080 3179.1965 3183.2246
redmass: 6.6064 7.0429 6.6449 8.9750 10.8880 5.2804 6.9346 4.6189 3.4539 5.3397 1.3129 4.5175 3.9469 5.8426 1.2307 4.3014 8.6480 5.7270 10.3845 6.1726 4.3365 7.0376 7.3640 3.4346 4.2657 4.0235 5.4293 5.0682 5.5663 2.9789 2.8958 3.9677 3.9904 3.0936 2.7322 8.3138 3.3492 6.0956 4.4156 6.8678 6.1442 5.7649 3.5130 6.1884 8.0229 4.3080 5.4858 8.9368 4.3490 1.4709 1.2673 2.6080 3.0631 3.3036 1.5870 1.3988 1.7393 1.4026 1.8821 4.0614 1.8699 2.5154 2.9326 1.6471 2.5237 2.5951 1.3420 1.6627 2.1278 1.1260 2.4166 1.8556 1.7831 1.1749 1.2918 1.6145 1.2977 1.1393 1.5836 1.3267 1.4732 1.9810 2.0271 2.1945 1.0533 2.0744 1.0571 1.0844 1.0667 1.0529 1.0946 2.1413 1.1261 7.3148 5.9308 8.9537 8.6200 1.0661 1.0387 1.0624 1.0602 1.0247 1.0986 1.0976 1.0937 1.1040 1.0885 1.0892 1.0878 1.1025 1.0955 1.0970 1.1071 1.1079
irintensity: 2.1123 4.3149 0.5761 1.2622 0.9790 1.1318 1.5090 6.0484 1.0440 0.9964 0.0786 6.9575 2.9594 0.6966 0.5299 2.2824 3.8175 3.1049 2.1076 6.7551 3.0708 10.8285 0.2543 8.4906 8.1744 7.8150 9.3183 0.2119 18.7597 32.4985 0.3958 22.7566 6.7653 18.2495 2.7512 58.2996 14.7460 34.5735 9.3296 8.7478 78.4449 7.0199 6.1118 7.5072 55.1330 36.3264 22.2343 53.7244 3.3484 17.5834 5.3570 30.2484 30.6994 38.4772 6.4838 68.1395 5.0682 1.3471 10.7591 0.9917 53.8467 4.7731 96.4430 12.0212 38.5656 34.8756 3.0805 43.4633 5.5929 2.1371 179.1863 35.3587 56.3876 23.8238 0.4825 16.5503 3.1961 3.8779 0.8348 12.2569 13.2599 43.9088 27.7858 32.3474 9.3219 36.7699 16.0008 22.0850 29.6287 17.6375 12.4701 26.3896 19.7767 0.2899 23.3511 187.0713 193.2390 23.4516 0.7357 9.4956 36.2874 1.2349 2.9781 1.9505 7.3067 12.1724 6.3577 5.3238 3.3993 5.6738 0.4626 10.3417 0.5758 1.1342
temp: 298.150 k
press: 1.00000 atm
elementType: 17 17 16 8 8 8 8 8 7 6 6 6 6 6 6 6 6 6 6 6 6 6 6 1 1 1 1 1 1 1 1 1 1 1 1 1 1 1 1 1
symmnumber: 1
zpe: 768716.9 jmol-1
zpe.correction: 0.292789 hartree
zpe.thermalcorrener: 0.317487 hartree
zpe.thermalcorrenthalpy: 0.318431 hartree
zpe.thermalcorrgfe: 0.234559 hartree
zpe.sumelectzpe: -2290.835310 hartree
zpe.sumelectthermal: -2290.810612 hartree
zpe.sumelectthermalent: -2290.809668 hartree
zpe.sumelectthermalfe: -2290.893540 hartree
dipole: -1.8372 -0.0898 -3.0192
dipole: 3.5353
quadrupole: -186.4348 -160.3590 -161.9414
quadrupole: 31.9920 -12.8741 -8.8332
quadrupole: -16.8564 9.2194 7.6370 31.9920 -12.8741 -8.8332
hfenergy: -2291.1280988 hartree
pointgroup: C01 [X(C14H17Cl2N1O5S1)]
dipole: 0.7079714 -0.4781722 -1.0976175 debye
polarizability: 273.2321149|-13.2637617|178.0629956|-1.3993972|-16.2180782|201.8891548 unknown
InChI: InChI=1S/C14H17Cl2NO5S/c1-10(18)22-8-7-17(14(19)13(15)16)9-11-3-5-12(6-4-11)23(2,20)21/h3-6,13H,7-9H2,1-2H3
charge 0 multiplicity 1
40 atoms
Cl 2.906526 -2.833925 -0.710546
Cl 1.538779 -3.804907 1.852348
S  -5.354271 0.542263 -0.067568
O  4.161353 1.565462 0.325533
O  2.665966 -1.089271 2.386141
O  -5.680279 0.819143 1.51212
O  -5.839271 1.550892 -1.262236
O  3.562676 0.980637 -1.856884
N  1.588185 0.050052 0.650843
C  0.82387 0.070374 -0.610651
C  -0.692814 0.183509 -0.43941
C  1.88455 1.350312 1.298347
C  -3.4716 0.353839 -0.227928
C  -1.476192 0.554638 -1.564222
C  -1.33171 -0.078329 0.798212
C  2.855675 2.24406 0.505421
C  -2.880886 0.644929 -1.468641
C  -2.737896 0.010729 0.916607
C  2.01548 -1.10566 1.305818
C  1.62774 -2.440033 0.623183
C  -6.054726 -1.191966 -0.485208
C  4.380911 0.930077 -0.908474
C  5.698784 0.196216 -0.896831
H  1.20253 0.908069 -1.223306
H  1.07762 -0.821673 -1.211315
H  0.940399 1.912867 1.44523
H  2.315989 1.120067 2.285843
H  -0.984714 0.783385 -2.517499
H  -0.733666 -0.336761 1.67891
H  2.459557 2.534298 -0.48386
H  3.076804 3.147974 1.096158
H  -3.499484 0.966161 -2.313598
H  -3.247092 -0.147936 1.873429
H  0.661706 -2.430231 0.104735
H  -5.644983 -1.892089 0.255475
H  -5.746359 -1.424853 -1.513499
H  -7.144366 -1.081962 -0.393668
H  6.038629 0.025011 -1.92881
H  6.455639 0.754958 -0.324747
H  5.559739 -0.783323 -0.403252
