program: Gaussian 09
title: 000198874
version: EM64L-G09RevD.01
frameworkgroup: C1[X(C9H8N2O2)]
method: RPBEPBE
basis: SDD
operation: Freq
keyword: #pfreq=noraman
keyword: PBEPBE/SDD
title: #p freq=noraman PBEPBE/SDD
converged: NO NO NO NO
title: Mulliken charges:
elementType: O O N N C C C C C C C C C H H H H H H H H
charge: -0.206528 -0.199123 -0.144794 0.012234 0.493972 0.470714 -0.473732 -0.371136 -0.429558 -0.189145 -0.803425 -0.312584 0.138833 0.251195 0.281977 0.243249 0.239288 0.236783 0.240252 0.230258 0.291273
chargesum: 0.00000
title: Mulliken charges with hydrogens summed into heavy atoms:
elementType: O O N N C C C C C C C C C
charge: -0.206528 -0.199123 -0.144794 0.012234 0.493972 0.470714 -0.222537 -0.089159 -0.186309 0.050143 -0.096133 -0.021312 0.138833
polarizability: 1.84599755e+02 -8.08704339e+00 1.25765191e+02 3.50183770e-02 2.39710662e+00 5.43129829e+01
1716.lowfreq: -38.7988 -9.4761 -5.8048 -0.0010 -0.0006 -0.0004 6.1296 41.3871 85.1935
frequency: -38.6518 41.3697 85.1847 114.4746 206.2830 218.6564 291.0077 312.2358 331.6485 408.5310 435.1816 458.8426 512.7519 517.1883 561.5341 605.1215 626.4073 654.7868 681.6312 694.1859 724.5997 801.5285 826.9849 884.8276 925.6184 929.4756 975.2283 987.9815 992.3155 1000.4613 1046.6147 1051.3761 1100.1941 1110.6549 1175.7655 1185.1811 1245.4880 1275.7002 1313.6769 1386.8484 1401.8026 1420.0096 1443.7919 1471.0791 1478.8761 1494.0719 1600.4131 1620.7755 1795.6408 2985.1284 3064.6359 3095.5096 3138.1210 3144.9356 3160.4232 3184.8204 3282.8750
redmass: 1.0283 5.9426 5.7949 5.3524 3.4181 4.4808 4.1836 7.8879 6.7901 5.0005 2.9738 7.7080 6.0040 5.1104 5.3684 5.7203 1.5625 7.7345 3.7500 2.2014 8.0823 1.4247 6.2177 1.3632 1.5233 4.2094 3.5626 4.7089 1.3646 2.1098 2.1373 1.5797 1.5861 3.8342 2.2173 1.1084 3.1892 2.2648 1.3531 5.4052 1.2858 4.1874 2.8281 1.0448 1.2406 2.7365 6.0858 6.5551 12.1108 1.0376 1.0977 1.0989 1.0885 1.0919 1.0938 1.0973 1.0977
irintensity: 0.4899 1.4101 2.2953 1.4926 5.6468 0.3656 1.9070 1.2660 3.1980 9.2353 4.6393 35.7650 16.2002 0.4458 3.9899 0.3723 18.5779 17.4917 29.5425 47.7536 17.3558 49.0513 9.5134 7.8616 10.3353 18.6873 8.6595 6.0557 0.6014 7.8344 27.1922 14.3897 20.2272 14.8918 8.9459 0.8761 9.1108 6.2264 1.2013 1.7913 16.2986 29.8999 0.2814 15.2190 25.7041 29.5172 2.9244 24.7176 694.3569 22.6956 15.5696 15.7548 7.5147 5.1620 15.7224 1.5379 6.4002
temp: 298.150 k
press: 1.00000 atm
elementType: 8 8 7 7 6 6 6 6 6 6 6 6 6 1 1 1 1 1 1 1 1
symmnumber: 1
zpe: 403622.7 jmol-1
zpe.correction: 0.153732 hartree
zpe.thermalcorrener: 0.164099 hartree
zpe.thermalcorrenthalpy: 0.165043 hartree
zpe.thermalcorrgfe: 0.116951 hartree
zpe.sumelectzpe: -606.714043 hartree
zpe.sumelectthermal: -606.703676 hartree
zpe.sumelectthermalent: -606.702732 hartree
zpe.sumelectthermalfe: -606.750823 hartree
dipole: -8.2714 -0.9903 -0.6913
dipole: 8.3591
quadrupole: -92.2161 -69.8782 -77.6637
quadrupole: 2.5934 -0.5450 -2.3339
quadrupole: -12.2968 10.0411 2.2556 2.5934 -0.5450 -2.3339
hfenergy: -606.8677744 hartree
pointgroup: C01 [X(C9H8N2O2)]
dipole: -3.2412045 -0.4360044 -0.3466727 debye
dipolederiv: -0.8318645 -0.2279188 -0.1315615 0.7005465 -0.2777161 -0.0137039 0.271559 -0.0548201 -0.1712658 -1.4890469 0.4788323 0.1140817 0.5767372 -0.5249716 -0.0517247 0.1461576 -0.0529407 -0.3224816 -0.1359103 -0.2064037 -0.0909837 -0.5035533 0.3807592 0.1390466 -0.2406943 0.1252947 0.1414058 0.5013059 0.2801052 0.1475338 0.4067951 -0.3599057 -0.0804376 0.1070609 -0.0973768 -0.109339 0.5000887 0.0107424 0.007298 -0.0414777 0.1534821 -0.0462546 0.0958054 -0.0114883 0.0583204 0.056817 0.2363437 -0.0183204 0.3495995 0.3010786 -0.0166242 -0.0379547 -0.0204247 -0.0141293 -0.1272015 -0.1690953 0.0274525 -0.0017245 -0.1014943 -0.0210161 0.0249566 -0.033225 -0.1600593 -0.109211 0.0465975 -0.0024754 -0.0039386 -0.0825692 -0.0128034 -0.0097969 0.0107692 -0.1372186 0.0620621 -0.0159376 0.013352 -0.1532513 -0.1668887 -0.0002874 0.0234819 -0.0002942 -0.1554827 0.0036305 -0.0859647 0.0120727 -0.0969355 0.1482085 -0.0262554 0.0089897 -0.0212348 -0.1171965 0.0398791 -0.0496294 0.0043781 -0.1245406 -0.1389341 0.0160786 0.0152571 0.0258136 0.0507765 -0.6607172 0.4002365 0.1489352 -0.1262761 -0.2699665 0.0070322 -0.0390617 0.0444407 -0.2346625 1.9963039 -0.7260484 -0.1712877 -1.0527382 0.6558979 0.0866174 -0.3014414 0.1039363 0.2727465 0.0826251 0.0740338 -0.010023 0.0793891 -0.0168153 0.0264716 -0.02723 0.016127 0.1500396 0.0824741 -0.0723631 0.0017538 -0.0654484 0.0667343 0.0198575 0.0301017 -0.0040577 0.1706142 -0.1113239 0.0113525 -0.0122159 -0.0107197 0.0974024 0.0059894 -0.0131457 0.0017884 0.1548509 0.0399173 0.066825 -0.0104005 0.0745605 -0.0602596 0.0231098 -0.0082032 0.0234312 0.1517691 0.057907 0.0154443 0.069813 -0.0267758 -0.0182642 -0.0911074 0.0161276 -0.1226669 -0.002662 0.0678729 -0.0154597 -0.0535715 -0.0394275 0.0237423 0.0805893 0.0005193 0.1128891 -0.0560797 -0.133462 -0.0066091 -0.0154321 0.0975961 0.0651576 0.0107411 -0.0249719 0.0026486 0.111375 0.1078537 -0.0450835 -0.030399 -0.0384166 0.1253224 -0.0553187 -0.0375168 -0.0486097 0.2186792 unknown
polarizability: 184.8416594|-7.1146497|125.1699245|1.9538201|5.2401678|54.6663459 unknown
InChI: InChI=1S/C9H8N2O2/c1-7-3-2-4-8(5-7)11-6-9(12)13-10-11/h2-6H,1H3
charge 0 multiplicity 1
21 atoms
O  3.023881 0.861058 0.50817
O  4.225689 -1.147681 -0.170091
N  0.975846 0.176647 0.101561
N  1.67433 1.266365 0.570793
C  -0.463763 0.286723 0.033305
C  -2.665696 -0.788528 0.03072
C  -1.253808 -0.880087 0.10626
C  -1.046976 1.56747 -0.102822
C  -3.252152 0.494512 -0.106669
C  -2.450241 1.657835 -0.167406
C  -3.518864 -2.04137 0.112117
C  1.746223 -0.90374 -0.247521
C  3.122804 -0.60578 -0.038066
H  -0.784103 -1.859572 0.249647
H  -0.411589 2.454929 -0.158698
H  -4.34266 0.583241 -0.164624
H  -2.921977 2.639867 -0.274642
H  -3.260528 -2.756969 -0.689922
H  -3.371607 -2.564031 1.075391
H  -4.591631 -1.804442 0.019496
H  1.337125 -1.802447 -0.691295
