program: Gaussian 09
title: 000198873
version: EM64L-G09RevD.01
frameworkgroup: C1[X(C9H9N2O2)]
method: RPBEPBE
basis: SDD
operation: Freq
keyword: #p
keyword: freq=noraman
keyword: PBEPBE/SDD
title: #p freq=noraman PBEPBE/SDD
converged: NO YES NO NO
title: Mulliken charges:
elementType: O O N N C C C C C C C C C H H H H H H H H H
charge: -0.059593 -0.138266 -0.126105 -0.293020 0.255200 0.415715 0.187089 -0.684817 -0.324838 -0.337649 -0.183178 -0.173360 -0.197283 0.296026 0.275518 0.307195 0.270319 0.280083 0.409368 0.272384 0.274342 0.274872
chargesum: 1.00000
title: Mulliken charges with hydrogens summed into heavy atoms:
elementType: O O N N C C C C C C C C C
charge: -0.059593 -0.138266 -0.126105 0.116347 0.255200 0.415715 0.187089 0.193922 -0.054519 -0.057566 0.089206 0.100982 0.077588
polarizability: 1.97054970e+02 -6.10425347e+00 1.10235546e+02 -6.03309548e-01 -8.50928991e+00 6.56083060e+01
1716.lowfreq: -8.6815 -4.6320 0.0006 0.0007 0.0009 6.0734 37.3250 71.3221 91.9182
frequency: 37.2917 71.3159 91.9163 107.2825 154.9146 233.2588 252.9674 282.7117 309.0962 329.9686 360.3191 395.4735 456.3362 514.4895 554.5110 593.2969 608.7449 656.4920 679.5850 691.5920 725.1812 760.4886 803.8450 836.6984 849.3382 938.9500 953.4562 985.4283 987.5052 1006.3961 1018.1115 1019.1307 1030.5050 1092.5489 1118.9380 1168.4868 1189.5404 1195.2145 1298.9617 1316.6343 1324.1696 1390.2243 1393.2806 1432.1785 1438.1934 1447.6266 1461.2271 1568.4356 1582.7142 1597.1256 1682.3153 2987.4453 3064.6968 3131.6659 3155.8577 3162.3203 3169.7834 3180.1487 3190.9390 3543.1138
redmass: 3.5344 6.8265 4.3305 1.1347 5.1818 3.1151 3.9093 3.3769 7.2928 2.2211 2.2595 2.8195 4.1416 5.7911 5.4846 5.6937 6.4993 6.9323 2.2464 6.1417 10.3637 1.6882 3.8301 1.2875 4.1008 1.4299 4.3633 3.9559 1.5814 2.5442 1.3834 1.5759 1.7506 1.5650 4.9134 2.5723 1.0578 1.2700 2.5793 1.9685 1.3617 1.2144 8.7944 1.0758 1.2329 1.8752 2.0383 6.0682 6.0640 6.4937 10.2973 1.0402 1.0930 1.1013 1.0894 1.0894 1.0932 1.0975 1.1020 1.0848
irintensity: 0.2426 0.7778 0.6213 1.3900 1.9972 2.0294 38.1266 15.2683 2.7716 58.9999 70.6118 0.3169 21.6855 35.9754 1.4191 3.5195 1.1365 9.6435 32.5494 1.3112 10.2430 100.8305 24.8414 3.9286 1.2062 4.8465 9.0180 9.3040 0.9128 14.0835 0.8750 4.5908 6.8083 9.0739 9.8539 56.8102 0.1674 0.0462 75.9438 25.2446 5.0497 52.4402 10.6249 24.7661 11.7973 15.0304 2.2437 111.8804 13.0431 0.0449 332.6736 17.7036 1.8808 3.0688 0.0419 0.4488 0.7776 0.1263 1.1998 258.6756
temp: 298.150 k
press: 1.00000 atm
elementType: 8 8 7 7 6 6 6 6 6 6 6 6 6 1 1 1 1 1 1 1 1 1
symmnumber: 1
zpe: 434127.1 jmol-1
zpe.correction: 0.165350 hartree
zpe.thermalcorrener: 0.177077 hartree
zpe.thermalcorrenthalpy: 0.178021 hartree
zpe.thermalcorrgfe: 0.126929 hartree
zpe.sumelectzpe: -607.029093 hartree
zpe.sumelectthermal: -607.017367 hartree
zpe.sumelectthermalent: -607.016422 hartree
zpe.sumelectthermalfe: -607.067515 hartree
dipole: 2.2526 -0.1160 0.2226
dipole: 2.2665
quadrupole: -49.0613 -53.6533 -69.7536
quadrupole: 6.9241 1.7740 -2.2960
quadrupole: 8.4281 3.8361 -12.2642 6.9241 1.7740 -2.2960
hfenergy: -607.1944434 hartree
pointgroup: C01 [X(C9H9N2O2)]
dipole: -0.8850643 0.0565076 0.0928708 debye
dipolederiv: -0.3585652 0.2366766 -0.1048644 -0.149857 -0.4743964 0.1793462 0.0455415 0.1941897 -0.0095413 -1.0963459 0.2167914 -0.0638466 0.1623606 -0.3614314 0.0306418 -0.0887552 0.0285517 -0.2811425 1.3161194 0.0494621 0.0023216 0.2722253 0.3651921 -0.2054365 -0.1352961 -0.1891949 0.089544 -0.3513882 -0.3107347 0.1389963 0.0643572 -0.364337 0.0340578 -0.0568993 0.0421182 -0.3786288 -0.5739101 0.1064534 -0.0386465 -0.254449 0.499548 -0.1590755 0.2361133 -0.1663896 0.1907648 -0.6111035 -0.0395553 0.0143472 -0.0091078 0.0540239 0.1326724 -0.0580055 0.0884515 0.050741 1.703725 -0.3842285 0.1021724 -0.3224163 0.4529553 -0.0527077 0.2119935 -0.0526928 0.2764006 -0.1013339 0.1045868 -0.0617565 0.1079992 -0.3184386 0.0926561 -0.1004585 0.0139785 -0.0176259 0.2446081 -0.0965855 -0.0809623 0.3813316 -0.0875829 0.0243936 0.1573085 0.0561516 -0.0705934 0.2875328 0.1220788 0.0641326 -0.3193035 -0.0143004 0.0335315 -0.1068601 0.0077061 -0.0541813 -0.3056842 0.1803799 0.1087156 0.2085774 0.026253 0.0719014 0.140648 0.0605763 -0.0621829 -0.2557536 -0.1854424 -0.1265232 -0.2621181 -0.0034522 0.061173 -0.1595353 0.0715083 -0.0518111 0.3090807 0.0149499 -0.0108623 0.0195487 0.0217192 0.057858 -0.0109204 0.0572599 -0.0304766 0.1925944 -0.0556181 0.0414576 -0.0189691 0.1308577 -0.0253107 0.0078036 -0.0065786 0.0372093 0.0073557 -0.0158904 0.0517715 0.0007496 0.1130889 -0.0042527 0.024785 0.0200762 0.1093203 0.1196928 -0.0655851 -0.0368514 -0.0291683 0.141872 -0.0123863 -0.0426065 0.0144194 0.1086992 0.0448026 0.0595767 0.0482895 0.0342422 0.0784131 -0.0512101 0.0487796 -0.0462675 0.1301216 0.072626 -0.0560515 -0.024829 -0.0384996 0.090106 -0.0517525 -0.0353157 -0.0344338 0.1325076 0.2380071 0.1218731 -0.0387073 0.1587941 0.4035714 0.0008753 -0.0946409 -0.006787 0.4381891 0.0637744 -0.0293577 -0.0150463 -0.0388541 0.0586791 -0.0685325 -0.0090909 -0.0681634 0.1243126 0.0573142 0.034407 0.0263503 0.0448054 0.0654536 -0.064106 0.0161969 -0.0637481 0.1216052 -0.0031486 -0.0081863 0.0043411 -0.0122484 0.1222057 -0.0243365 0.0092145 -0.020732 0.1467684 unknown
polarizability: 196.9785577|-6.5708453|111.1590326|-0.2146039|5.9038272|64.7612314 unknown
InChI: InChI=1S/C9H9N2O2/c1-7-9(12)10-13-11(7)8-5-3-2-4-6-8/h2-6,10H,1H3
charge 1 multiplicity 1
22 atoms
O  1.00556 1.482418 -0.602146
O  3.984076 -0.419016 0.026697
N  0.512757 0.16574 -0.086323
N  2.433306 1.297837 -0.559892
C  1.516646 -0.650593 0.189817
C  -0.912308 0.079379 -0.059128
C  2.830366 0.027772 -0.115241
C  1.427326 -2.012093 0.776073
C  -1.539235 -1.012027 -0.715948
C  -1.648245 1.090901 0.60975
C  -2.94414 -1.098746 -0.66999
C  -3.052495 0.98777 0.631622
C  -3.698706 -0.103546 -0.000729
H  1.669094 -2.767703 0.002461
H  0.437199 -2.236738 1.199866
H  2.211229 -2.114552 1.548361
H  -0.949853 -1.754585 -1.263628
H  -1.136006 1.923387 1.101381
H  2.968426 2.136376 -0.808856
H  -3.450292 -1.929923 -1.169325
H  -3.641963 1.753077 1.144303
H  -4.790444 -0.174737 0.022074
