program: Gaussian 09
title: 000198872
version: EM64L-G09RevD.01
frameworkgroup: C1[X(C9H8N2O2)]
method: RPBEPBE
basis: SDD
operation: Freq
keyword: #pfreq=noraman
keyword: PBEPBE/SDD
title: #p freq=noraman PBEPBE/SDD
converged: YES YES NO NO
title: Mulliken charges:
elementType: O O N N C C C C C C C C C H H H H H H H H
charge: -0.129346 -0.270007 -0.131279 -0.052032 0.364790 0.174380 -0.335530 -0.358456 -0.714367 0.034423 -0.203534 -0.193351 -0.231789 0.251543 0.276759 0.244252 0.292619 0.256245 0.240177 0.242905 0.241596
chargesum: 0.00000
title: Mulliken charges with hydrogens summed into heavy atoms:
elementType: O O N N C C C C C C C C C
charge: -0.129346 -0.270007 -0.131279 -0.052032 0.364790 0.174380 -0.083987 -0.081697 0.078749 0.034423 0.036644 0.049554 0.009807
polarizability: 2.12685586e+02 -1.63457070e+00 1.21228613e+02 -1.39018164e+00 -6.58853610e+00 5.94379163e+01
1716.lowfreq: -8.0788 0.0004 0.0006 0.0006 1.7688 6.2486 38.9193 68.9733 96.1295
frequency: 38.8935 68.9711 96.1264 114.0489 166.1548 182.1025 247.1250 289.1151 302.8085 326.8503 399.8138 403.6398 462.8689 512.4666 574.9561 608.6871 633.4905 665.0672 686.7600 691.3697 743.2703 768.6426 840.7365 843.8986 924.3651 978.0348 981.0125 986.5827 1000.8751 1011.3288 1025.5805 1036.5606 1061.7451 1086.8954 1169.2354 1177.2825 1187.4191 1276.8683 1319.0139 1381.7445 1391.5955 1436.3595 1442.7933 1461.1985 1471.2530 1584.3404 1592.0848 1601.0664 1634.8539 2983.9709 3067.4308 3110.8242 3140.5082 3149.9111 3161.9550 3172.1206 3182.1851
redmass: 3.7344 7.2804 5.2302 1.0519 5.0252 5.8936 3.8663 5.5478 7.0092 7.5281 5.5583 3.1869 5.4459 4.5501 6.1862 6.3311 7.0648 7.1920 4.7298 2.3834 6.5728 1.7274 1.5239 2.8058 1.3915 1.4234 5.8984 5.9314 1.3332 2.8554 1.6202 1.7057 8.9628 1.5838 2.4121 1.0637 1.2291 5.0019 1.3479 8.1766 1.2308 1.0652 2.2790 1.1712 1.8691 6.1843 10.5800 6.0827 9.6586 1.0374 1.0940 1.1021 1.0857 1.0892 1.0937 1.0974 1.1002
irintensity: 1.3957 2.7962 2.3349 2.8816 2.2737 43.7435 0.5199 0.4872 2.8003 22.9025 15.6938 4.4354 16.1833 6.5056 22.2536 0.4346 8.1049 6.7077 35.2338 39.5997 6.4299 78.0145 1.6382 4.9678 4.9952 0.9362 12.1816 0.8174 0.4404 20.2752 10.3960 1.5053 136.6861 7.1389 3.4491 0.1377 3.0562 5.1757 0.1168 0.5631 34.8508 26.7328 10.9415 3.8600 42.2815 3.9127 557.3777 3.9385 28.9262 5.9554 6.0498 1.8620 0.6816 5.1347 16.2271 10.3617 6.5579
temp: 298.150 k
press: 1.00000 atm
elementType: 8 8 7 7 6 6 6 6 6 6 6 6 6 1 1 1 1 1 1 1 1
symmnumber: 1
zpe: 399892.8 jmol-1
zpe.correction: 0.152311 hartree
zpe.thermalcorrener: 0.163908 hartree
zpe.thermalcorrenthalpy: 0.164852 hartree
zpe.thermalcorrgfe: 0.113957 hartree
zpe.sumelectzpe: -606.678756 hartree
zpe.sumelectthermal: -606.667160 hartree
zpe.sumelectthermalent: -606.666215 hartree
zpe.sumelectthermalfe: -606.717111 hartree
dipole: -8.3131 3.3789 0.9414
dipole: 9.0228
quadrupole: -91.0104 -69.8524 -75.5632
quadrupole: 5.2231 1.3065 -4.3796
quadrupole: -12.2017 8.9562 3.2455 5.2231 1.3065 -4.3796
hfenergy: -606.8310674 hartree
pointgroup: C01 [X(C9H8N2O2)]
dipole: -3.3154347 1.1971318 0.4195399 debye
dipolederiv: 0.6930645 -0.8326611 -0.2548003 -0.830025 -0.3276491 -0.0524006 -0.096163 -0.0746371 -0.0050531 -1.4598316 -0.2626593 -0.0374051 -0.4529346 -0.4078492 -0.0075562 -0.1046801 -0.0098708 -0.3415484 -0.5794671 0.3547158 0.1362688 0.5143853 0.1973357 0.1226094 0.1239423 0.0754893 -0.0400379 -1.1363059 0.7034404 0.2210146 -0.6372927 -0.0256701 0.059536 -0.2715396 0.0360826 -0.2247528 0.713138 -0.0572152 -0.0204858 0.0818912 0.0330718 -0.0919633 -0.0856315 -0.0479774 0.0906318 -0.2067369 -0.3430139 -0.0989248 0.2612594 0.2687981 0.0371712 0.0950398 0.0652762 0.0666868 -0.1322691 0.0798298 -0.0174757 -0.013682 -0.0604357 -0.0416119 0.0266009 -0.054858 -0.1149169 -0.0924749 -0.0496713 0.0288332 -0.0343694 -0.0132502 -0.0506666 0.0092005 -0.0186138 -0.1042789 0.0840157 -0.0106139 -0.0160547 -0.069392 -0.1201928 -0.0216643 -0.0473474 0.0435575 0.0856083 1.8943122 0.3902235 0.0390256 1.1079348 0.0322684 -0.0709656 0.3237544 -0.0511225 0.1177023 -0.0445406 -0.1013553 0.0310695 -0.1321587 0.0512774 -0.0897457 0.04197 -0.0746923 -0.0967452 -0.0172541 0.0989791 -0.0507407 0.1397122 0.0690966 -0.0813189 -0.0826239 -0.0841088 -0.0929383 0.0522075 -0.001442 -0.0046959 0.0052128 -0.067153 -0.0315031 -0.0057197 -0.0330084 -0.1272682 0.0470659 -0.080224 0.043068 -0.058395 0.022073 0.0638525 0.0535793 0.0552291 0.1290524 0.0768911 0.0672159 -0.0238469 0.0528081 0.0585695 0.056509 -0.0200169 0.0315098 0.140195 -0.00242 0.0458377 0.1038435 -0.0056883 0.070553 -0.0123084 0.0661577 -0.0431602 0.0507493 0.0367836 -0.0414386 -0.0820205 0.0451038 0.1146611 -0.004008 -0.0305123 -0.0447959 0.0880666 0.1346358 0.0394874 -0.0098395 0.0181375 0.0169843 0.0364724 -0.0139968 0.0593595 -0.0233142 0.022351 0.0623935 -0.0245195 0.0838605 -0.0126066 0.0779647 -0.0367669 0.0758429 0.1253516 0.0217929 -0.0658557 0.0333738 -0.0863054 -0.0055597 0.0750549 0.0417397 0.0730719 0.1241483 -0.1049578 0.0040272 0.0043125 0.0099375 0.1056777 0.0265423 0.0130135 0.0214265 0.1526613 unknown
polarizability: 212.6232184|1.8916725|121.3367535|-2.9756606|-6.2005724|59.3921442 unknown
InChI: InChI=1S/C9H8N2O2/c1-7-9(12)10-13-11(7)8-5-3-2-4-6-8/h2-6H,1H3
charge 0 multiplicity 1
21 atoms
O  1.076837 -1.563986 -0.446983
O  3.906414 0.514885 -0.035893
N  0.426367 -0.108184 -0.037197
N  2.430945 -1.368665 -0.434624
C  -0.98236 -0.061238 -0.026112
C  1.454917 0.686621 0.118971
C  -1.662713 1.079554 -0.530215
C  -1.702249 -1.171682 0.485287
C  1.458297 2.123633 0.53006
C  2.767281 -0.029995 -0.12565
C  -3.071778 1.108897 -0.497693
C  -3.110473 -1.130164 0.497048
C  -3.799181 0.008182 0.013424
H  -1.098247 1.91718 -0.951919
H  -1.153883 -2.041791 0.856732
H  0.585411 2.390799 1.148463
H  2.399559 2.315501 1.073272
H  1.474331 2.778275 -0.362745
H  -3.601296 1.986255 -0.883312
H  -3.6710 -1.985457 0.887787
H  -4.893578 0.034882 0.029797
