program: Gaussian 09
title: 000198889
version: EM64L-G09RevD.01
frameworkgroup: C1[X(C10H18N3O2)]
method: RPBEPBE
basis: SDD
operation: Freq
keyword: #p
keyword: freq=noraman
keyword: PBEPBE/SDD
title: #p freq=noraman PBEPBE/SDD
converged: YES YES NO NO
title: Mulliken charges:
elementType: O O N N N C C C C C C C C C C H H H H H H H H H H H H H H H H H H
charge: -0.150237 -0.107275 -0.011108 -0.053374 -0.108925 -0.391019 -0.392111 -0.375740 -0.375109 -0.403718 -0.405983 -0.432842 0.274353 0.117587 -0.705362 0.216555 0.253496 0.254033 0.218201 0.189611 0.242440 0.243057 0.193075 0.213432 0.253528 0.252912 0.231747 0.286832 0.275167 0.352533 0.259073 0.277865 0.307304
chargesum: 1.00000
title: Mulliken charges with hydrogens summed into heavy atoms:
elementType: O O N N N C C C C C C C C C C
charge: -0.150237 -0.107275 -0.011108 -0.053374 0.243609 0.079032 0.080123 0.056312 0.061024 0.063242 0.078676 0.129156 0.274353 0.117587 0.138880
polarizability: 3.33356210e+02 1.35642201e+01 1.35537387e+02 -1.70485303e+01 6.58116999e-01 9.77913551e+01
1716.lowfreq: -18.5977 -8.8649 -3.6912 -0.0002 0.0001 0.0007 16.5228 31.4676 39.2221
frequency: 13.7512 31.4523 38.6095 61.3655 66.2904 94.7853 155.2636 184.9576 217.7821 248.1977 253.7679 290.0209 301.6452 310.4940 407.8862 412.2871 414.9417 433.6909 492.0827 508.6126 536.5338 577.7621 597.2924 651.0975 659.7806 679.5531 741.7221 777.1826 792.8075 811.5540 839.6219 842.0936 877.1417 888.2394 898.6238 940.0730 981.9997 987.3030 1018.4551 1024.7131 1027.4646 1083.3325 1097.7472 1101.5088 1119.7867 1131.9079 1149.9091 1193.4034 1206.0628 1244.7902 1264.9579 1270.7461 1280.1772 1305.7761 1312.6774 1324.2809 1329.5956 1333.6460 1340.4973 1345.5575 1347.6327 1364.5682 1398.2327 1404.3428 1447.8047 1454.1675 1456.5118 1458.2839 1459.5849 1464.0459 1464.6356 1468.4977 1473.8135 1545.3561 1750.8250 2964.5031 2967.2124 2975.9961 2976.8863 2978.7394 2984.8308 2989.0136 3047.3660 3052.9154 3054.3705 3055.2142 3056.5631 3058.4923 3065.7354 3066.8237 3115.4146 3132.4610 3320.4330
redmass: 3.7783 3.8522 3.0334 1.3196 3.5625 2.8665 5.4683 2.7264 1.8577 2.8699 3.7797 3.5969 2.4814 2.8424 2.5645 2.2287 2.7212 2.9059 4.7960 5.7256 1.6968 5.9615 2.8388 6.8667 7.1213 6.9055 3.6810 1.2544 1.4843 4.9497 1.9633 1.9447 3.0273 3.1574 3.2566 1.3439 2.9547 2.4555 1.9108 2.2178 1.4860 1.5470 2.4187 2.1962 3.3471 1.4020 1.2579 1.8206 1.6475 1.2480 1.3261 1.2394 1.4381 1.4407 1.2458 1.3146 1.3279 1.3009 1.4736 1.3095 1.7962 1.4033 2.0057 1.2068 1.1006 1.0956 1.0892 1.0938 1.0843 1.0974 1.0980 1.1071 1.0945 4.6058 12.5534 1.0654 1.0651 1.0624 1.0623 1.0650 1.0399 1.0622 1.0985 1.0751 1.0979 1.0861 1.0961 1.0994 1.0968 1.1029 1.0980 1.1094 1.0795
irintensity: 0.6360 0.4530 3.8563 2.8010 5.3951 1.4105 1.3325 0.2776 0.0202 2.2903 10.8308 6.6461 3.9297 0.2401 10.7078 0.4410 0.7800 0.1217 53.4327 22.0287 11.2236 37.4662 53.3813 33.1313 13.2169 62.1069 19.2593 2.2412 0.2692 61.0585 1.7717 16.4506 23.2620 83.1073 2.4469 8.0663 77.7360 57.9314 0.1720 3.8107 5.1316 30.0469 4.3572 12.6836 11.2570 3.7270 4.3456 58.1803 6.9014 9.2823 110.6088 32.2647 16.0570 51.5737 4.4219 3.2389 2.5024 44.3129 0.3747 5.5006 45.9483 1.9739 10.2887 28.6396 35.3477 18.5436 20.6607 25.6836 4.4751 6.3617 44.9138 29.9297 15.1096 234.9792 771.0870 22.2783 28.4381 0.1347 20.1876 40.0927 2.0897 33.1148 9.9173 16.5078 12.7025 22.2277 38.1972 4.4009 6.0892 45.7625 0.5842 0.5284 30.4977
temp: 298.150 k
press: 1.00000 atm
elementType: 8 8 7 7 7 6 6 6 6 6 6 6 6 6 6 1 1 1 1 1 1 1 1 1 1 1 1 1 1 1 1 1 1
symmnumber: 1
zpe: 731794.8 jmol-1
zpe.correction: 0.278726 hartree
zpe.thermalcorrener: 0.294336 hartree
zpe.thermalcorrenthalpy: 0.295280 hartree
zpe.thermalcorrgfe: 0.233267 hartree
zpe.sumelectzpe: -705.040504 hartree
zpe.sumelectthermal: -705.024894 hartree
zpe.sumelectthermalent: -705.023950 hartree
zpe.sumelectthermalfe: -705.085963 hartree
dipole: -3.8804 0.5667 0.2743
dipole: 3.9312
quadrupole: -77.6186 -72.6826 -85.9080
quadrupole: 3.9202 -1.3016 -2.7925
quadrupole: 1.1178 6.0538 -7.1716 3.9202 -1.3016 -2.7925
hfenergy: -705.3192302 hartree
pointgroup: C01 [X(C10H18N3O2)]
dipole: 1.5189832 -0.2626491 0.1257457 debye
polarizability: 331.5798877|6.7075539|134.0933487|29.1785356|6.6208367|101.0117157 unknown
InChI: InChI=1S/C10H18N3O2/c1-9-10(14)15-11-13(9)8-7-12-5-3-2-4-6-12/h11H,2-8H2,1H3
charge 1 multiplicity 1
33 atoms
O  -3.397835 1.43692 0.177989
O  -4.793635 -0.493409 0.012937
N  2.094945 -0.033205 1.12999
N  -1.40881 0.370148 -0.312028
N  -1.998712 1.666484 -0.127222
C  2.736685 -1.346904 0.900523
C  2.99138 1.138839 1.012381
C  3.507206 -1.389679 -0.446392
C  3.767199 1.145525 -0.332158
C  4.495377 -0.202958 -0.544592
C  0.679127 0.109041 1.146495
C  0.042045 0.27182 -0.346129
C  -2.345309 -0.600338 -0.3506
C  -3.661867 -0.022408 -0.055175
C  -2.115796 -2.028323 -0.714877
H  1.967971 -2.139152 0.95303
H  3.453853 -1.530026 1.72741
H  3.723015 1.097235 1.845788
H  2.399225 2.062826 1.142237
H  2.792511 -1.352817 -1.293924
H  4.045792 -2.352216 -0.518974
H  4.4898 1.981789 -0.322309
H  3.067987 1.331484 -1.172697
H  5.285812 -0.319311 0.22397
H  5.003685 -0.210857 -1.525076
H  0.200518 -0.775894 1.605035
H  0.387047 1.006886 1.726167
H  0.44728 1.182556 -0.815994
H  0.319522 -0.605797 -0.94949
H  -1.576209 2.193914 0.665271
H  -1.376219 -2.5246 -0.060938
H  -1.765711 -2.125759 -1.760774
H  -3.068882 -2.573518 -0.628072
