program: Gaussian 09
title: 000198854
version: EM64L-G09RevD.01
frameworkgroup: C1[X(C14H19FN2O2)]
method: RPBEPBE
basis: SDD
operation: Freq
keyword: #p
keyword: freq=noraman
keyword: PBEPBE/SDD
title: #p freq=noraman PBEPBE/SDD
converged: YES YES NO NO
title: Mulliken charges:
elementType: F O O N N C C C C C C C C C C C C C C H H H H H H H H H H H H H H H H H H H
charge: -0.220298 -0.243233 -0.253865 -0.173728 -0.445968 -0.349923 -0.345309 -0.314001 -0.313508 -0.451539 0.146076 0.325200 0.558713 -0.509842 -0.541665 0.094599 -0.414856 -0.329135 -0.674436 0.213727 0.228728 0.216776 0.205851 0.201442 0.221932 0.219617 0.198467 0.242757 0.235726 0.377464 0.313405 0.217589 0.206164 0.240197 0.250432 0.219218 0.217825 0.229398
chargesum: 0.00000
title: Mulliken charges with hydrogens summed into heavy atoms:
elementType: F O O N N C C C C C C C C C C C C C C
charge: -0.220298 -0.243233 -0.253865 -0.173728 -0.068504 0.092532 0.077318 0.109374 0.104576 0.026944 0.146076 0.325200 0.558713 -0.196436 -0.117912 0.094599 -0.174660 -0.078702 -0.007994
polarizability: 2.30732374e+02 -8.66171887e+00 1.78251743e+02 -9.96515534e+00 -2.75584872e+00 1.16314802e+02
1716.lowfreq: -10.2332 -5.2480 -0.0004 0.0004 0.0005 3.6691 12.6944 22.3900 37.3191
frequency: 11.4977 22.3290 37.2938 42.0672 82.2873 99.6990 105.1894 110.9186 157.4690 208.0180 217.5866 243.5486 250.3391 283.5499 293.8019 320.4714 333.0009 338.9304 379.1690 400.5110 438.3986 454.7679 469.1544 473.3279 498.8808 532.9669 565.7914 616.8929 636.9119 659.5694 690.9555 728.4218 770.8830 787.4484 797.5207 810.6893 811.9821 841.7122 885.4701 907.8782 923.0980 927.3396 942.6361 947.6404 979.2205 989.1876 1002.2502 1024.6214 1052.5495 1058.8679 1062.7186 1083.1113 1099.5800 1105.6453 1130.6772 1135.4798 1151.9335 1172.9451 1192.4772 1200.4386 1216.3670 1241.6212 1257.0221 1268.0898 1279.6973 1293.5784 1296.3941 1314.5761 1317.5288 1338.1214 1353.6100 1371.7781 1374.2256 1387.2046 1390.0145 1432.7984 1444.7816 1446.1613 1450.9623 1454.1651 1460.6230 1468.6950 1471.5543 1476.5337 1491.2176 1524.0486 1597.8588 1621.8672 1627.4005 2903.4345 2909.6018 2949.1141 2954.5180 2958.5320 2979.7379 2990.3501 3033.8358 3037.7223 3038.2688 3041.1975 3078.8135 3084.8151 3086.0864 3089.3608 3138.0928 3170.3969 3174.0413 3280.4189
redmass: 2.7424 4.6956 5.8940 3.1030 5.2908 4.8405 4.7604 4.7968 3.4546 3.9946 1.3072 2.0194 6.1044 3.1491 4.3436 3.1440 2.5089 3.3145 5.5868 2.0110 4.2330 3.5629 3.2287 3.8837 5.3192 4.2545 3.7060 2.1480 4.1507 5.3750 4.3697 3.6945 3.7980 1.2823 4.2892 1.5589 2.9944 1.5980 2.2199 3.4847 1.3741 1.1961 1.3537 3.6951 2.0411 2.2781 2.5993 2.1998 1.9988 1.6149 2.0361 3.8640 2.5205 2.1963 2.6148 2.3335 1.7356 2.0956 1.0722 1.9109 1.2390 1.2606 1.8117 1.3141 1.3479 1.4035 1.3701 1.4378 1.7538 1.2544 1.3356 1.4315 1.2792 1.5691 2.9037 3.2580 1.0839 1.1111 1.2763 1.1166 1.4086 1.2806 1.0560 1.0923 1.0947 2.8973 5.9382 7.8604 8.1953 1.0687 1.0681 1.0656 1.0670 1.0667 1.0348 1.0601 1.0927 1.0934 1.0938 1.1018 1.1001 1.1014 1.0960 1.0975 1.0896 1.0930 1.0957 1.0764
irintensity: 0.0681 0.1644 0.5824 0.0973 9.3661 1.5145 0.7816 4.2532 3.7777 0.5986 0.6675 1.3119 0.7442 2.6081 4.4523 8.0819 10.9361 1.6378 0.8758 0.7911 19.5996 14.5327 1.0784 1.2719 6.5498 16.8009 1.1741 6.2092 9.2332 3.6950 17.5259 3.5587 10.4005 1.5909 2.0869 25.6687 42.7964 1.0220 15.2991 12.0941 26.0801 56.4945 14.4544 1.4844 2.8051 3.8456 26.0428 15.1821 20.6572 15.9521 7.1308 54.3990 37.8447 15.3914 17.7795 26.8459 24.8674 15.8710 1.4452 8.8873 6.1727 0.9266 5.1842 15.0158 17.6634 1.1078 2.0609 15.9465 0.6644 3.9216 2.1087 19.4737 2.1084 13.0172 14.7776 15.9340 6.0467 20.8170 53.2168 38.1488 30.3334 59.7987 3.5181 23.7307 12.7115 563.8069 8.0489 161.8796 137.3138 59.4031 88.0404 43.9887 27.5751 93.6782 38.3265 34.0481 13.0349 34.1439 33.0787 6.5027 56.9102 40.7496 37.4461 36.6874 10.3830 1.4227 7.9518 348.4769
temp: 298.150 k
press: 1.00000 atm
elementType: 9 8 8 7 7 6 6 6 6 6 6 6 6 6 6 6 6 6 6 1 1 1 1 1 1 1 1 1 1 1 1 1 1 1 1 1 1 1
symmnumber: 1
zpe: 819840.0 jmol-1
zpe.correction: 0.312261 hartree
zpe.thermalcorrener: 0.330613 hartree
zpe.thermalcorrenthalpy: 0.331558 hartree
zpe.thermalcorrgfe: 0.262968 hartree
zpe.sumelectzpe: -903.237938 hartree
zpe.sumelectthermal: -903.219585 hartree
zpe.sumelectthermalent: -903.218641 hartree
zpe.sumelectthermalfe: -903.287230 hartree
dipole: 0.0812 0.5572 -0.6997
dipole: 0.8981
quadrupole: -106.0480 -119.7112 -109.5568
quadrupole: -12.5323 -4.9542 2.2005
quadrupole: 5.7240 -7.9392 2.2152 -12.5323 -4.9542 2.2005
hfenergy: -903.5501986 hartree
pointgroup: C01 [X(C14H19F1N2O2)]
dipole: -0.0430392 0.3253772 0.1308614 debye
polarizability: 225.109469|26.9108486|129.9281205|-11.3643161|18.0679481|170.2613288 unknown
InChI: InChI=1S/C14H19FN2O2/c1-2-11-3-4-12(15)13(9-11)16-14(18)10-17-5-7-19-8-6-17/h3-4,9,16H,2,5-8,10H2,1H3
charge 0 multiplicity 1
38 atoms
F  -0.175014 0.792744 2.119086
O  4.928801 0.688763 1.491817
O  0.176498 -1.372613 -2.432284
N  2.90176 0.210679 -0.522113
N  0.294198 -0.233493 -0.361727
C  3.467082 -0.910187 0.283448
C  3.902702 1.300299 -0.685435
C  3.928794 -0.380094 1.650798
C  4.358116 1.790551 0.70024
C  2.266646 -0.244398 -1.778849
C  0.800868 -0.693196 -1.564117
C  -0.991236 -0.421482 0.186206
C  -3.310873 -1.261156 0.17494
C  -2.049674 -1.115499 -0.455303
C  -4.444322 -1.972171 -0.552173
C  -1.244931 0.111957 1.474845
C  -3.51511 -0.705866 1.464242
C  -2.474359 -0.011509 2.12487
C  -5.233861 -1.017904 -1.488571
H  4.329127 -1.382966 -0.244087
H  2.687497 -1.681946 0.426156
H  3.436821 2.1365 -1.239764
H  4.792719 0.951212 -1.260925
H  3.05276 0.003802 2.217776
H  4.429589 -1.169421 2.234353
H  5.162748 2.538557 0.61082
H  3.493904 2.233631 1.241003
H  2.247175 0.592743 -2.502494
H  2.800436 -1.085091 -2.272999
H  1.007061 0.296778 0.176992
H  -1.863351 -1.539124 -1.445679
H  -4.03826 -2.807687 -1.153097
H  -5.142074 -2.415664 0.183457
H  -4.486107 -0.817886 1.959218
H  -2.607335 0.4188 3.121699
H  -5.680482 -0.18382 -0.917409
H  -6.048246 -1.558459 -2.004928
H  -4.568868 -0.582684 -2.256108
